program: Gaussian 09
title: 000052899
version: EM64L-G09RevD.01
frameworkgroup: C1[X(C12H16N2O)]
method: RPBEPBE
basis: SDD
operation: Freq
keyword: #p
keyword: freq=noraman
keyword: PBEPBE/SDD
title: #p freq=noraman PBEPBE/SDD
converged: YES YES NO NO
title: Mulliken charges:
elementType: O N N C C C C C C C C C C C C H H H H H H H H H H H H H H H H
charge: -0.273055 -0.469960 -0.571530 0.223769 0.161857 0.184170 0.202218 -0.539210 -0.575342 -0.397969 -0.330703 -0.800240 0.306213 -0.353289 -0.536852 0.229696 0.197907 0.294664 0.242383 0.213978 0.202152 0.227047 0.248139 0.247263 0.216611 0.244868 0.274447 0.259383 0.240271 0.216120 0.214996
chargesum: 0.00000
title: Mulliken charges with hydrogens summed into heavy atoms:
elementType: O N N C C C C C C C C C C C C
charge: -0.273055 -0.175296 -0.037699 0.223769 0.161857 0.184170 0.202218 -0.111607 -0.332959 0.018160 -0.103655 -0.088228 0.306213 -0.108421 0.134535
polarizability: 2.03422939e+02 1.07117097e+01 1.64904059e+02 -5.95228843e+00 8.22284702e+00 8.55690636e+01
1716.lowfreq: -99.0032 -4.7463 0.0002 0.0004 0.0005 1.0135 7.0885 36.4340 61.7378
frequency: -98.9912 36.3867 61.7346 88.3338 91.9296 115.8548 161.8748 195.6289 208.0651 213.9226 250.0553 257.1767 266.2947 342.6848 364.8461 394.9623 410.2963 430.6208 467.8627 484.3775 532.4361 566.7720 595.0865 608.3210 639.7352 670.4919 708.6575 749.6819 781.3600 798.7756 809.6984 838.4612 853.0295 928.5157 929.4746 948.1469 981.4264 997.4628 1034.3462 1050.3685 1087.2158 1105.0113 1114.5175 1127.7797 1148.7842 1157.6596 1194.3603 1226.4499 1241.0883 1251.2666 1285.6390 1302.4014 1308.9196 1321.8746 1376.7151 1401.8342 1416.3038 1426.6552 1444.3651 1460.3254 1462.5391 1467.3869 1471.8997 1477.1318 1479.8779 1484.5390 1492.3406 1576.8746 1598.9726 1633.3184 1636.5540 2888.9756 2946.8745 2959.2315 2974.4792 3020.4113 3029.3297 3046.9030 3053.5223 3076.9456 3115.9622 3133.1763 3152.7896 3170.0103 3450.8996 3578.3848 3606.2437
redmass: 1.0171 3.3353 3.4096 2.1855 2.9636 3.8664 3.1937 3.4759 1.8686 1.3912 1.9149 2.2628 2.0183 3.2570 4.9193 5.6844 5.8908 2.8520 3.7042 1.1643 3.5136 4.3443 1.3329 3.0673 3.9511 5.1629 5.0277 3.2782 1.3116 1.5376 4.3214 1.7485 3.6122 1.8803 1.5652 2.4613 1.5389 4.1553 1.4455 2.2656 3.0927 2.0043 1.2623 1.2781 1.7141 1.5287 2.9699 1.3747 1.3375 2.4736 1.1516 1.5919 2.2327 2.6384 1.3816 1.4706 2.9346 1.5498 1.8712 1.0783 1.0506 1.7595 1.4652 1.8807 1.6984 1.2145 1.0874 7.6623 6.4753 6.8577 1.0988 1.0712 1.0335 1.0662 1.0381 1.0866 1.1033 1.0973 1.0967 1.0987 1.0985 1.0894 1.0905 1.0953 1.0448 1.0974 1.0804
irintensity: 0.0925 0.5594 2.1334 10.5926 1.7646 1.6256 3.8860 0.7550 1.0863 38.8223 13.2071 2.2962 1.9423 16.9966 0.4306 4.0287 2.1123 1.9488 4.1216 90.8315 0.7783 8.3581 244.4615 17.5895 3.8529 0.3167 4.5154 0.4100 1.8690 46.8143 17.2938 32.7322 0.9681 2.1257 1.3287 8.2551 10.1027 36.8845 9.1172 5.0880 26.7553 24.8965 0.1898 7.3478 16.8711 7.0455 141.8563 10.6678 0.5320 28.3355 6.1404 16.2743 0.7293 8.8643 14.5374 1.8123 54.2657 22.1652 45.2313 16.0307 13.2463 28.9430 5.2598 100.6781 10.9689 3.2201 6.3208 0.7163 45.0656 34.9518 40.1617 94.8137 61.8756 38.7868 48.4562 25.1040 57.1491 40.9252 18.7418 20.4145 32.6747 14.3397 11.2683 9.3185 1.2820 0.1117 47.2460
temp: 298.150 k
press: 1.00000 atm
elementType: 8 7 7 6 6 6 6 6 6 6 6 6 6 6 6 1 1 1 1 1 1 1 1 1 1 1 1 1 1 1 1
symmnumber: 1
zpe: 677384.8 jmol-1
zpe.correction: 0.258002 hartree
zpe.thermalcorrener: 0.272671 hartree
zpe.thermalcorrenthalpy: 0.273615 hartree
zpe.thermalcorrgfe: 0.216200 hartree
zpe.sumelectzpe: -650.476313 hartree
zpe.sumelectthermal: -650.461644 hartree
zpe.sumelectthermalent: -650.460700 hartree
zpe.sumelectthermalfe: -650.518115 hartree
dipole: -1.6988 0.0218 -0.4286
dipole: 1.7521
quadrupole: -94.6643 -66.0090 -92.5457
quadrupole: 9.4414 3.1364 1.2620
quadrupole: -10.2580 18.3973 -8.1393 9.4414 3.1364 1.2620
hfenergy: -650.7343148 hartree
pointgroup: C01 [X(C12H16N2O1)]
dipole: -0.6674592 -0.0314185 -0.1694316 debye
polarizability: 202.1085378|12.7315154|166.4240557|-6.3625531|6.8913247|85.3634686 unknown
InChI: InChI=1S/C12H16N2O/c1-8-10(5-6-13)11-7-9(15-2)3-4-12(11)14-8/h3-4,7,14H,5-6,13H2,1-2H3
charge 0 multiplicity 1
31 atoms
O  3.55022 1.133461 -0.013508
N  -0.825314 -2.340767 -0.098014
N  -3.250058 3.12617 -0.372511
C  -1.386491 -0.163976 0.310598
C  0.052741 -0.248671 0.135221
C  -1.89392 -1.462775 0.159932
C  0.378852 -1.624817 -0.1184
C  -2.189719 1.085936 0.574749
C  1.093997 0.721223 0.179224
C  -2.440366 1.934469 -0.70095
C  1.707697 -2.052875 -0.331565
C  -3.307517 -1.969856 0.259979
C  2.418663 0.286622 -0.030974
C  2.725654 -1.085258 -0.286198
C  3.314858 2.550384 0.247761
H  -3.175095 0.845579 1.014498
H  -1.662571 1.720277 1.31882
H  -0.920014 -3.34392 -0.239727
H  0.857798 1.771615 0.37467
H  -3.00497 1.322089 -1.428929
H  -1.455357 2.164317 -1.174118
H  1.952574 -3.10307 -0.525814
H  -3.66878 -1.97198 1.306157
H  -4.001733 -1.33976 -0.32357
H  -3.396118 -3.002547 -0.123725
H  3.77405 -1.355772 -0.442716
H  -3.601718 3.640338 -1.185988
H  -2.808473 3.750588 0.31079
H  4.309099 3.021138 0.219911
H  2.856099 2.708673 1.244632
H  2.666512 3.004168 -0.528834
