program: Gaussian 09
title: 000052902
version: EM64L-G09RevD.01
frameworkgroup: C1[X(C17H22N2O3)]
method: RPBEPBE
basis: SDD
operation: Freq
keyword: #p
keyword: freq=noraman
keyword: PBEPBE/SDD
title: #p freq=noraman PBEPBE/SDD
converged: YES YES NO NO
title: Mulliken charges:
elementType: O O O N N C C C C C C C C C C C C C C C C C H H H H H H H H H H H H H H H H H H H H H H
charge: -0.313620 -0.247898 -0.230540 -0.439341 -0.078631 0.290104 -0.556717 0.120216 0.241255 0.020653 -0.370493 -0.545511 -0.355838 0.346132 -0.364551 0.155975 -0.615697 -0.616545 0.065980 -0.792331 -0.255035 -0.662474 0.254300 0.225976 0.208499 0.219595 0.339067 0.259208 0.240872 0.280926 0.235077 0.194221 0.215757 0.222306 0.188266 0.223946 0.240136 0.238881 0.261958 0.223116 0.237195 0.219648 0.251446 0.224511
chargesum: 0.00000
title: Mulliken charges with hydrogens summed into heavy atoms:
elementType: O O O N N C C C C C C C C C C C C C C C C C
charge: -0.313620 -0.247898 -0.230540 -0.100274 -0.078631 0.290104 -0.076441 0.120216 0.241255 0.020653 0.057601 -0.286303 -0.114966 0.346132 -0.083625 0.155975 0.029358 0.017972 0.065980 -0.051356 0.205276 0.033130
polarizability: 3.40377537e+02 -5.13938385e+00 2.29479254e+02 -9.69274524e+00 -1.35734003e+01 1.27065982e+02
1716.lowfreq: -8.2032 -4.3309 -0.0002 0.0004 0.0007 2.5332 11.6057 26.8897 35.2041
frequency: 11.0561 26.8373 35.1928 36.2006 47.8688 67.6893 80.4360 89.5120 94.9452 101.5529 151.8582 152.0648 159.5301 180.5565 197.4952 213.1119 224.6012 236.8169 244.7047 270.5166 301.2391 307.4328 325.5158 338.0702 363.8598 412.1793 416.9602 433.9181 437.8558 445.2958 463.6711 536.0618 556.4077 583.7426 593.1397 620.4503 620.7352 668.8399 687.2290 710.0993 738.5597 772.2598 779.5264 785.6780 803.0030 817.2415 834.9073 836.4429 857.5104 907.7763 922.0997 943.5674 987.4906 997.4765 1008.4540 1026.5442 1032.0473 1036.0280 1047.2109 1054.9555 1074.9294 1089.2674 1095.5133 1125.9089 1138.4887 1153.1835 1156.4813 1178.4831 1223.2881 1229.7352 1252.4631 1261.1572 1265.8048 1280.1630 1297.7509 1302.1141 1316.8859 1326.9610 1358.3980 1361.0191 1369.7564 1391.2239 1415.5022 1419.0556 1426.6835 1441.8819 1448.1097 1457.3171 1459.5241 1461.1968 1462.6612 1464.6075 1468.0147 1471.4005 1474.5998 1475.9834 1479.0450 1483.4628 1486.6796 1556.4326 1566.6144 1596.0928 1625.9859 1629.8268 2848.5046 2857.8792 2871.2158 2985.6293 2992.8396 3008.5890 3015.8900 3016.6536 3029.6273 3032.6772 3070.1308 3074.8377 3078.3197 3087.5655 3091.2568 3092.5235 3118.1274 3124.1916 3140.3990 3147.4918 3164.0649 3602.6844
redmass: 3.9732 2.6334 3.0366 4.3602 3.6643 7.2072 3.8955 4.0102 2.3068 4.6172 1.8059 1.7385 3.0570 3.1215 2.0086 1.2539 1.4394 2.0967 1.4223 5.6624 2.9083 6.2864 3.5813 3.2369 3.1138 4.0322 3.8644 3.1501 3.2380 2.8101 4.1293 3.6118 4.2198 5.0006 4.2059 1.5596 2.1135 3.5941 4.9516 4.3468 9.3665 4.1411 4.0512 1.4412 2.0531 1.9069 3.7825 1.4821 3.4814 1.5328 3.8645 2.0773 1.3299 2.4507 3.0171 1.8336 1.8431 2.9472 2.2207 2.1184 2.6594 1.2817 2.1654 1.5302 1.3536 1.6511 1.9117 3.0607 1.7065 1.5035 1.8637 2.7807 2.3023 1.1149 1.3621 1.3836 2.3513 3.3116 1.3465 1.3112 1.2768 1.2322 3.5474 1.1832 3.3095 1.1557 1.1407 1.1066 1.1247 1.1100 1.0538 1.0497 3.9944 1.0911 3.6909 1.0881 1.1117 1.0555 1.0614 8.2215 6.1285 7.5575 7.4361 9.6395 1.0593 1.0646 1.0592 1.0374 1.0361 1.0599 1.0863 1.0746 1.0593 1.0738 1.0970 1.1014 1.1016 1.0978 1.0995 1.1032 1.1059 1.0992 1.0887 1.0911 1.0962 1.0807
irintensity: 0.0850 0.3481 0.0178 0.2768 1.4386 8.1252 0.9596 0.2584 0.8669 0.3865 0.7250 0.4468 3.1404 2.3605 0.4017 3.7660 2.0722 3.6656 0.5031 1.3606 13.2518 1.4045 0.1862 16.5773 2.0051 3.1427 5.4530 7.5393 5.5079 0.5208 1.2010 0.2244 14.5556 4.2484 25.2297 45.5072 26.4487 31.0697 9.1511 6.2881 2.9177 1.4052 27.2232 2.9886 5.9827 1.5908 2.8840 55.9159 3.5321 13.4699 5.1612 53.1041 0.8963 20.0488 0.9425 1.1194 151.7245 256.8513 57.8845 18.9701 147.4791 4.8573 20.0562 4.6160 9.7395 32.7722 34.8864 98.4753 142.2633 106.5570 190.2206 7.6117 19.8903 2.1109 10.8490 12.9128 26.1545 180.2444 16.2968 14.8723 74.8425 25.7402 4.4173 8.9260 39.1906 2.0020 25.2966 15.3323 8.8966 15.1779 15.0701 20.0457 47.9693 5.3151 3.7599 19.0370 15.5272 14.0613 23.6342 66.8174 177.8602 127.0290 8.8029 374.5212 73.7015 54.7377 180.6449 3.7549 22.6384 18.7117 17.6368 48.6753 39.3910 44.7577 12.7170 23.2092 28.4862 40.1860 43.1494 2.7774 31.4782 20.8506 6.4981 5.2429 8.1441 117.1268
temp: 298.150 k
press: 1.00000 atm
elementType: 8 8 8 7 7 6 6 6 6 6 6 6 6 6 6 6 6 6 6 6 6 6 1 1 1 1 1 1 1 1 1 1 1 1 1 1 1 1 1 1 1 1 1 1
symmnumber: 1
zpe: 945676.6 jmol-1
zpe.correction: 0.360189 hartree
zpe.thermalcorrener: 0.383330 hartree
zpe.thermalcorrenthalpy: 0.384274 hartree
zpe.thermalcorrgfe: 0.304666 hartree
zpe.sumelectzpe: -994.554174 hartree
zpe.sumelectthermal: -994.531033 hartree
zpe.sumelectthermalent: -994.530089 hartree
zpe.sumelectthermalfe: -994.609697 hartree
dipole: 4.8558 -0.9327 0.7723
dipole: 5.0046
quadrupole: -148.2128 -115.2523 -132.1940
quadrupole: -18.5006 5.6714 0.1622
quadrupole: -16.3264 16.6341 -0.3077 -18.5006 5.6714 0.1622
hfenergy: -994.9143631 hartree
pointgroup: C01 [X(C17H22N2O3)]
dipole: -1.8798637 -0.4979936 -0.3079736 debye
polarizability: 339.1310411|12.8826465|230.5894488|-10.4008565|13.4629168|127.2022828 unknown
InChI: InChI=1S/C17H22N2O3/c1-5-22-17(21)16-13(8-9-19(3)4)14-10-12(11(2)20)6-7-15(14)18-16/h6-7,10,18H,5,8-9H2,1-4H3
charge 0 multiplicity 1
44 atoms
O  -3.094561 -2.413613 0.12799
O  -3.480524 -0.168338 0.70875
O  5.775118 -0.504382 -0.310828
N  -0.446473 -2.097768 -0.096423
N  -1.383197 3.803907 -0.109938
C  -0.39362 0.133578 0.471341
C  -0.811528 1.533691 0.832732
C  0.955589 -0.328077 0.214255
C  0.886643 -1.728513 -0.135999
C  -1.229954 -0.9807 0.267635
C  -1.1448 2.378347 -0.430928
C  2.217451 0.315051 0.254178
C  2.046937 -2.482018 -0.443699
C  3.381163 -0.425875 -0.052038
C  3.278436 -1.81894 -0.397903
C  -2.681976 -1.089264 0.397073
C  -2.628216 4.02784 0.656229
C  -1.326041 4.656785 -1.315586
C  4.749208 0.187226 -0.03032
C  4.895136 1.662628 0.335949
C  -4.563998 -2.673767 0.194339
C  -5.236568 -2.346118 -1.141865
H  -1.699045 1.493889 1.486564
H  -0.002247 2.051261 1.379693
H  -2.020238 1.910804 -0.949886
H  -0.285785 2.328357 -1.12716
H  -0.849475 -3.015175 -0.280665
H  2.280469 1.375101 0.521693
H  1.987314 -3.543121 -0.707182
H  4.211317 -2.345266 -0.625172
H  -2.597223 3.480132 1.612615
H  -3.545501 3.701424 0.103867
H  -2.726733 5.103665 0.886831
H  -1.420897 5.718251 -1.023333
H  -2.132233 4.432586 -2.060383
H  -0.351113 4.527208 -1.819077
H  4.505326 1.862167 1.351514
H  4.334034 2.306048 -0.367088
H  5.960746 1.934828 0.299986
H  -4.628912 -3.745938 0.440351
H  -4.987635 -2.068599 1.014854
H  -6.306548 -2.622117 -1.097119
H  -5.169107 -1.267084 -1.359093
H  -4.769836 -2.9086 -1.968955
