program: Gaussian 09
title: 000052998
version: EM64L-G09RevD.01
frameworkgroup: C1[X(C14H14N4O5S)]
method: RPBEPBE
basis: SDD
operation: Freq
keyword: #p
keyword: freq=noraman
keyword: PBEPBE/SDD
title: #p freq=noraman PBEPBE/SDD
converged: YES YES NO NO
title: Mulliken charges:
elementType: S O O O O O N N N N C C C C C C C C C C C C C C H H H H H H H H H H H H H H
charge: 1.020745 -0.490045 -0.518212 -0.443386 -0.202546 -0.222831 -0.652792 -0.409688 -0.078073 0.001431 -0.153000 0.313129 -0.193177 -0.333150 -0.221794 -0.211630 0.328322 -0.045458 0.123179 0.249398 0.255833 -0.456259 -0.766114 -0.762934 0.311104 0.353969 0.277925 0.250682 0.245779 0.344860 0.245708 0.246532 0.223943 0.250437 0.219150 0.248290 0.256023 0.394651
chargesum: 0.00000
title: Mulliken charges with hydrogens summed into heavy atoms:
elementType: S O O O O O N N N N C C C C C C C C C C C C C C
charge: 1.020745 -0.490045 -0.518212 -0.048735 -0.202546 -0.222831 -0.298823 -0.064828 -0.078073 0.001431 -0.153000 0.313129 0.117928 -0.055225 0.028888 0.034149 0.328322 -0.045458 0.123179 0.249398 0.255833 -0.210551 -0.045203 -0.039471
polarizability: 2.81342517e+02 1.69141730e+01 2.36458742e+02 1.81442543e+00 -1.49268155e+01 1.76078251e+02
1716.lowfreq: -8.8533 -3.0678 -2.8225 0.0009 0.0014 0.0016 13.0032 17.0651 29.6965
frequency: 12.9359 17.0527 29.6550 45.4345 59.5464 62.9977 65.4485 70.3427 81.3869 110.7398 121.1840 144.1795 161.8424 167.9444 178.5936 183.2142 212.4131 215.5032 217.4818 254.1233 264.6311 284.4843 301.9399 322.8019 331.8309 362.8601 380.5794 415.9544 454.2786 458.3987 485.4787 524.8604 527.5707 542.6276 556.3924 570.6391 571.8459 600.7041 616.0500 642.3389 664.7670 681.3211 683.9714 741.4087 745.8893 754.0313 775.3909 786.4272 792.6764 824.4393 868.8874 900.2833 901.2250 933.6756 962.0958 971.0528 980.1988 985.6574 996.9546 1008.0356 1011.8850 1023.5303 1046.7396 1048.6433 1055.0966 1075.0917 1119.1667 1143.7796 1177.1232 1177.9574 1178.9491 1250.8946 1262.8419 1287.8637 1323.4001 1333.3050 1350.6329 1377.5587 1392.8360 1396.1528 1423.8924 1426.5689 1452.5086 1455.3961 1459.2241 1463.0135 1465.7736 1484.9103 1529.4755 1563.0988 1564.4632 1604.7897 1646.8049 1649.2953 2993.4515 2994.6989 3078.9311 3081.1376 3107.7090 3108.3113 3146.9865 3159.2723 3169.1003 3171.0448 3179.6215 3509.0020 3518.7915 3531.3034
redmass: 4.6568 6.1353 5.9337 7.5136 1.0914 1.1466 4.5907 6.0903 5.5235 5.3843 5.5676 7.2440 7.0314 3.0637 7.1703 6.5257 5.6355 6.1866 6.6355 4.8800 7.9379 3.3593 5.6748 8.0124 1.5970 8.3691 5.3820 4.2172 7.4011 3.7274 4.3499 4.7672 5.2783 5.3675 3.5319 1.6206 4.3729 4.6092 2.1433 6.6492 2.2147 3.3803 3.9515 4.6784 3.3202 5.0015 5.4726 1.4645 6.5510 15.5509 1.2655 1.3994 4.2552 6.5378 9.1896 3.0644 1.4902 5.6411 2.8935 1.3810 4.9865 1.5666 1.6609 1.5881 2.1320 3.1781 1.7747 2.1389 1.1944 1.4956 1.5257 3.8200 1.4434 1.9641 2.4848 2.8345 4.3120 5.7347 1.2910 1.2590 2.4053 4.1158 1.0460 1.0459 2.5518 1.3126 1.0973 2.3337 4.7169 5.8885 5.0896 7.1031 9.2412 8.9331 1.0368 1.0366 1.0971 1.0969 1.1005 1.1008 1.0867 1.0905 1.0947 1.0935 1.1007 1.0777 1.0638 1.0760
irintensity: 0.2874 0.3788 0.8027 1.0560 1.1130 1.1846 4.0527 2.8460 7.6856 4.0736 6.4505 0.8821 6.4252 0.2506 7.5266 2.4704 0.3881 2.1630 5.0690 4.0607 2.9534 1.4649 4.2051 4.7264 82.3320 53.5950 13.9130 21.7124 137.4903 6.3295 17.6612 11.9475 1.6827 18.5208 0.0425 54.0964 142.5488 33.3484 11.9432 27.0036 56.2273 32.5063 77.6622 24.2143 51.7801 10.2778 13.3385 56.1372 3.8667 166.9036 12.8295 2.6127 1.2257 18.2801 67.1143 7.1494 6.2898 22.9154 15.9650 1.1158 83.0811 7.1352 23.2077 0.2200 40.6582 148.4665 10.6294 355.6212 21.7733 109.1513 12.5345 12.2013 3.2860 332.0818 50.8190 82.2966 175.5119 4.1155 62.5051 71.3153 30.7674 81.5786 12.0822 19.6377 3.6756 472.0345 29.8783 633.5867 164.0906 10.7299 205.4827 14.6836 186.1961 246.9955 12.4688 9.2039 8.9818 9.4128 11.1514 29.1937 3.8865 4.8378 1.7014 8.0075 17.4614 45.8978 45.8599 54.2562
temp: 298.150 k
press: 1.00000 atm
elementType: 16 8 8 8 8 8 7 7 7 7 6 6 6 6 6 6 6 6 6 6 6 6 6 6 1 1 1 1 1 1 1 1 1 1 1 1 1 1
symmnumber: 1
zpe: 709138.5 jmol-1
zpe.correction: 0.270097 hartree
zpe.thermalcorrener: 0.294319 hartree
zpe.thermalcorrenthalpy: 0.295263 hartree
zpe.thermalcorrgfe: 0.212731 hartree
zpe.sumelectzpe: -1533.186888 hartree
zpe.sumelectthermal: -1533.162666 hartree
zpe.sumelectthermalent: -1533.161721 hartree
zpe.sumelectthermalfe: -1533.244254 hartree
dipole: -4.6061 3.9482 3.7815
dipole: 7.1487
quadrupole: -128.1241 -134.8104 -152.7084
quadrupole: 16.7152 -5.4835 -10.5367
quadrupole: 10.4235 3.7373 -14.1608 16.7152 -5.4835 -10.5367
hfenergy: -1533.4569849 hartree
pointgroup: C01 [X(C14H14N4O5S1)]
dipole: -1.8752174 -0.8325224 -1.9237398 debye
polarizability: 280.4247147|-15.1892395|238.4993824|-10.8527465|11.5740819|174.9554133 unknown
InChI: InChI=1S/C14H14N4O5S/c1-8-7-9(2)16-13(15-8)17-14(21)18-24(22,23)11-6-4-3-5-10(11)12(19)20/h3-7,17-19H,1-2H3
charge 0 multiplicity 1
38 atoms
S  2.210068 0.970195 1.441235
O  2.083015 0.314402 2.910734
O  3.068879 2.325609 1.226863
O  2.23679 1.946163 -1.503575
O  -0.322845 -0.779125 1.117702
O  4.241116 1.492409 -2.574402
N  0.518684 1.407734 0.868022
N  -1.752342 1.073169 0.646122
N  -4.043938 1.30831 0.400518
N  -2.949177 -0.758999 -0.31173
C  2.809947 -0.416393 0.255519
C  3.341398 -0.158608 -1.02899
C  2.786445 -1.690921 0.837626
C  3.910757 -1.261627 -1.722497
C  3.330759 -2.774566 0.111882
C  3.902919 -2.55452 -1.161195
C  -0.51329 0.435836 0.882818
C  -2.960507 0.486533 0.229501
C  3.362976 1.149214 -1.753814
C  -5.254211 0.807395 0.004073
C  -4.16706 -1.260837 -0.692289
C  -5.352943 -0.498274 -0.541807
C  -6.45063 1.708975 0.186054
C  -4.159198 -2.650086 -1.280269
H  2.359108 -1.819362 1.836558
H  0.546335 2.167454 0.178015
H  4.350636 -1.075306 -2.707393
H  3.312323 -3.778533 0.547041
H  4.341026 -3.388928 -1.718024
H  -1.850342 2.051888 0.93031
H  -6.320185 -0.903564 -0.848294
H  -6.304904 2.653541 -0.36805
H  -7.379695 1.229444 -0.162305
H  -6.565075 1.978772 1.251216
H  -5.173203 -2.988228 -1.549002
H  -3.519209 -2.677598 -2.180412
H  -3.719494 -3.36075 -0.558157
H  2.36357 2.820084 -1.963303
