program: Gaussian 09
title: 000053054
version: EM64L-G09RevD.01
frameworkgroup: C1[X(C26H18Cl4O)]
method: RPBEPBE
basis: SDD
operation: Freq
keyword: #p
keyword: freq=noraman
keyword: PBEPBE/SDD
title: #p freq=noraman PBEPBE/SDD
converged: YES YES NO NO
title: Mulliken charges:
elementType: Cl Cl Cl Cl O C C C C C C C C C C C C C C C C C C C C C C C C C C H H H H H H H H H H H H H H H H H H
charge: -0.057269 -0.047283 -0.057302 -0.047354 -0.314331 -0.318442 -0.318997 0.446446 0.504168 0.448044 0.503428 -0.402505 -0.428899 -0.402885 -0.428738 -0.390214 -0.342095 -0.389517 -0.341407 -0.210200 -0.209778 -0.210258 -0.209728 -0.210491 -0.212530 -0.210677 -0.212939 -0.112369 -0.120536 -0.112237 -0.120330 0.232218 0.232560 0.236274 0.242401 0.236064 0.242122 0.272572 0.256721 0.272077 0.256553 0.255852 0.259438 0.255844 0.259398 0.255256 0.258325 0.255231 0.258321
chargesum: 0.00000
title: Mulliken charges with hydrogens summed into heavy atoms:
elementType: Cl Cl Cl Cl O C C C C C C C C C C C C C C C C C C C C C C C C C C
charge: -0.057269 -0.047283 -0.057302 -0.047354 -0.314331 -0.086224 -0.086437 0.446446 0.504168 0.448044 0.503428 -0.166231 -0.186497 -0.166821 -0.186616 -0.117643 -0.085374 -0.117440 -0.084854 0.045652 0.049659 0.045587 0.049670 0.044765 0.045795 0.044554 0.045382 -0.112369 -0.120536 -0.112237 -0.120330
polarizability: 2.98275028e+02 -3.45539307e-01 3.66711578e+02 -1.24190093e+01 3.70012828e-02 2.99622066e+02
1716.lowfreq: -4.6172 -2.7844 0.0013 0.0016 0.0020 3.4606 10.9349 17.3421 20.5875
frequency: 10.8852 17.3281 20.5680 22.8733 28.1832 29.5276 34.1276 34.2904 43.7686 70.6056 96.7387 116.3385 118.2290 128.3947 135.1684 175.9493 182.7419 201.2444 243.3581 265.1290 278.2346 287.9862 295.6945 303.3728 316.6021 334.8373 337.1385 375.7520 395.3909 406.1168 406.6027 407.7490 408.1187 418.0680 435.7992 464.1411 495.6018 505.3372 506.3117 535.3124 586.5637 620.9188 622.6701 623.8075 624.8773 656.2738 665.7350 676.8180 693.6941 715.0542 718.0485 729.3497 729.4981 793.8505 794.8678 817.5671 819.7797 829.3517 832.1586 833.6307 835.0228 846.7817 851.6194 860.7989 886.5870 935.8297 949.6961 953.0164 955.8001 958.4757 965.6384 967.6039 977.2651 981.1579 993.4120 1000.0605 1000.6404 1001.8863 1008.7899 1071.1444 1071.4062 1072.2854 1072.8142 1103.6165 1104.6853 1110.3495 1111.5283 1177.7188 1178.7392 1180.7094 1181.4227 1184.5678 1185.4768 1204.9609 1210.8765 1263.6055 1267.8130 1281.6328 1292.8403 1301.2620 1305.9697 1307.8728 1330.1163 1376.9313 1379.3203 1382.2433 1382.3757 1391.8647 1392.6251 1398.3300 1401.4467 1473.8978 1474.1621 1475.6970 1477.0459 1586.6016 1587.1722 1587.8827 1588.6417 1595.8243 1596.0893 1601.4694 1601.9833 2961.7806 2964.6207 3124.4057 3126.4629 3129.5398 3129.6938 3145.2809 3145.3384 3157.4644 3157.8180 3169.1915 3169.3057 3171.5866 3171.7151 3172.8795 3172.9191 3177.2189 3177.6259
redmass: 12.6546 5.6081 7.0780 16.5688 5.3510 11.0719 4.1965 5.5649 3.7899 9.0516 8.9402 8.6746 8.4706 8.3887 8.4721 10.7278 9.1259 9.1632 10.2855 7.0578 7.2820 7.7157 6.8819 5.7709 6.6090 4.6149 5.1203 7.1612 5.0277 3.0085 2.9429 2.9360 3.3876 6.5652 7.5629 4.5517 3.2574 3.7595 4.3723 3.5064 4.2758 6.9091 7.0387 7.1158 7.1145 6.1630 5.6281 5.6476 5.2059 4.0276 4.5705 3.7399 3.7708 2.6038 2.5573 1.8698 1.6742 1.2707 1.2657 1.3225 1.3274 2.4284 1.9265 2.1747 2.8930 5.8861 1.3570 1.3515 1.3771 1.4433 1.3767 1.3881 1.3510 1.3529 6.3601 4.1600 4.0522 4.2296 5.4252 2.8173 2.7785 2.7843 2.7852 1.3664 1.3742 1.3526 1.3481 1.2206 1.8239 1.5328 1.3574 1.5858 1.2129 2.1635 1.9691 1.6435 1.5922 1.2467 1.2638 1.3430 1.4310 1.3521 1.6219 5.4703 5.0765 6.1419 6.0947 3.0858 2.9461 2.3744 2.3213 2.3804 2.3802 2.4525 2.4663 7.3125 7.1931 7.6202 7.6417 6.1889 6.1903 6.3056 6.2716 1.0835 1.0842 1.0901 1.0899 1.0900 1.0900 1.0890 1.0890 1.0885 1.0885 1.0948 1.0949 1.0952 1.0952 1.0964 1.0964 1.0969 1.0968
irintensity: 0.0065 0.2227 0.0863 0.0009 0.5646 0.1192 0.1170 0.0993 0.0090 0.1358 0.1925 1.1031 0.0680 0.1450 0.1105 0.2085 4.3581 0.1512 4.4698 0.7228 0.2071 2.4919 0.0082 4.3796 0.2279 0.9934 3.6547 3.7487 4.5905 1.4875 0.6112 0.2273 1.5324 15.4271 7.7126 3.1882 47.9798 12.2068 94.3825 10.4819 14.4374 2.8027 0.0396 0.2114 2.6434 3.0076 2.0439 9.9808 3.3088 0.4691 2.6687 4.6114 3.7475 196.7888 10.0714 126.3225 7.0002 7.3908 0.1680 0.1723 0.0152 2.8017 0.0353 38.6348 13.5363 20.3344 5.2575 0.1534 2.4033 0.0305 0.3487 0.0307 2.1773 0.8299 264.5681 54.5607 61.4567 0.6781 58.4833 68.4010 51.1162 43.7086 14.2787 0.3617 0.0012 16.9523 20.6046 12.0153 0.7356 11.0748 2.9664 8.5695 0.2646 2.0031 0.4234 13.2934 6.3279 11.4416 4.8370 1.9170 1.9551 4.6070 3.0207 1.7163 0.4577 1.9838 0.0553 5.6502 7.2845 7.5033 9.5923 87.9888 74.4173 109.0412 46.0077 0.7891 2.1047 3.5191 1.8425 29.0134 15.3939 16.2165 3.0593 33.8958 7.9473 19.7251 0.0432 5.1953 13.1902 3.5288 2.1151 1.8372 1.2933 2.0564 5.9842 4.4027 5.1056 1.4008 0.1148 1.8747 0.2693
temp: 298.150 k
press: 1.00000 atm
elementType: 17 17 17 17 8 6 6 6 6 6 6 6 6 6 6 6 6 6 6 6 6 6 6 6 6 6 6 6 6 6 6 1 1 1 1 1 1 1 1 1 1 1 1 1 1 1 1 1 1
symmnumber: 1
zpe: 938793.9 jmol-1
zpe.correction: 0.357568 hartree
zpe.thermalcorrener: 0.385407 hartree
zpe.thermalcorrenthalpy: 0.386351 hartree
zpe.thermalcorrgfe: 0.292097 hartree
zpe.sumelectzpe: -2914.881885 hartree
zpe.sumelectthermal: -2914.854046 hartree
zpe.sumelectthermalent: -2914.853102 hartree
zpe.sumelectthermalfe: -2914.947356 hartree
dipole: -0.0038 -1.9369 0.0013
dipole: 1.9369
quadrupole: -232.3645 -209.7683 -215.3232
quadrupole: -0.0708 -3.3546 0.0275
quadrupole: -13.2125 9.3837 3.8288 -0.0708 -3.3546 0.0275
hfenergy: -2915.239453 hartree
pointgroup: C01 [X(C26H18Cl4O1)]
dipole: 0.0045612 0.0002798 -0.7620105 debye
polarizability: 302.1582194|12.0186654|295.7484543|-0.8555241|0.061288|366.7019984 unknown
InChI: InChI=1S/C26H18Cl4O/c27-21-9-1-17(2-10-21)25(18-3-11-22(28)12-4-18)31-26(19-5-13-23(29)14-6-19)20-7-15-24(30)16-8-20/h1-16,25-26H
charge 0 multiplicity 1
49 atoms
Cl -5.889124 -1.29735 3.733253
Cl -2.443604 4.685447 -3.725481
Cl 5.819594 1.304408 3.830207
Cl 2.510554 -4.696463 -3.668623
O  -0.0078 -0.000524 0.652666
C  -1.230115 -0.201427 -0.155724
C  1.227615 0.199117 -0.135174
C  -2.359403 -0.488118 0.83197
C  -1.523547 1.01406 -1.043302
C  2.339902 0.488572 0.871007
C  1.537357 -1.01869 -1.014141
C  -3.530287 -1.141883 0.376031
C  -1.63881 0.867932 -2.446189
C  3.516213 1.146017 0.434869
C  1.690835 -0.874095 -2.413489
C  -2.278237 -0.08764 2.187253
C  -1.687497 2.301037 -0.470242
C  2.237613 0.086577 2.224411
C  1.679333 -2.30604 -0.436107
C  -4.610869 -1.390675 1.249711
C  -1.924267 1.978947 -3.273257
C  4.581614 1.396907 1.326389
C  1.992926 -1.987084 -3.231949
C  -3.348924 -0.33176 3.076854
C  -1.96234 3.423146 -1.278985
C  3.292938 0.332581 3.131621
C  1.970214 -3.430071 -1.236532
C  -4.501151 -0.977961 2.591868
C  -2.080731 3.24169 -2.67259
C  4.451158 0.982425 2.666139
C  2.126907 -3.250165 -2.626548
H  -1.089323 -1.086871 -0.811093
H  1.097933 1.082748 -0.795276
H  -3.610297 -1.459049 -0.670624
H  -1.505549 -0.119674 -2.904682
H  3.612425 1.464543 -0.609994
H  1.574422 0.113826 -2.875844
H  -1.368769 0.401384 2.54688
H  -1.597151 2.426235 0.614085
H  1.323691 -0.405195 2.568706
H  1.558726 -2.429987 0.645427
H  -5.514058 -1.89587 0.89603
H  -2.019504 1.864364 -4.356761
H  5.488999 1.905107 0.98814
H  2.117729 -1.873774 -4.312577
H  -3.285871 -0.026285 4.125346
H  -2.088921 4.416299 -0.838551
H  3.213641 0.025739 4.178599
H  2.079907 -4.423558 -0.79233
