program: Gaussian 09
title: 000006779
version: EM64L-G09RevD.01
frameworkgroup: C1[X(C18H24O4)]
method: RPBEPBE
basis: SDD
operation: Freq
keyword: #pfreq=noraman
keyword: PBEPBE/SDD
title: #p freq=noraman PBEPBE/SDD
converged: YES YES NO NO
title: Mulliken charges:
elementType: O O O O C C C C C C C C C C C C C C C C C C H H H H H H H H H H H H H H H H H H H H H H H H
charge: -0.302490 -0.248283 -0.263090 -0.236947 0.054172 -0.448289 -0.440210 -0.396277 -0.402092 -0.387889 0.181716 0.097096 0.232576 -0.334789 -0.373258 -0.262655 -0.328610 -0.377867 0.154454 -0.223309 -0.220576 -0.691332 0.234264 0.212768 0.206056 0.203229 0.243947 0.206388 0.198623 0.199931 0.206122 0.204247 0.191244 0.272748 0.189222 0.206595 0.234472 0.228977 0.222745 0.188115 0.262470 0.235901 0.237576 0.214754 0.211828 0.205728
chargesum: 0.00000
title: Mulliken charges with hydrogens summed into heavy atoms:
elementType: O O O O C C C C C C C C C C C C C C C C C C
charge: -0.302490 -0.248283 -0.263090 -0.236947 0.288436 -0.029465 0.006966 0.008734 0.003961 0.007602 0.181716 0.097096 0.232576 -0.062042 0.022559 0.200793 0.082250 -0.115396 0.154454 0.012591 0.017000 -0.059022
polarizability: 2.50732000e+02 -1.34951472e+01 2.22186697e+02 1.30875621e+00 2.41262039e+01 1.50590101e+02
1716.lowfreq: -28.7296 -17.8459 -1.0593 0.0007 0.0008 0.0009 6.2960 9.2824 29.8646
frequency: -26.4059 -11.7806 29.6892 36.1598 43.9020 49.0969 60.2593 79.4330 96.1944 103.2480 132.4353 165.4139 189.1683 210.6166 216.8823 222.3671 229.7046 254.7966 259.0161 295.6472 324.9972 327.6561 339.9268 372.7486 418.8941 435.0953 438.5252 451.6013 481.1690 499.2881 543.3413 573.0405 642.5050 669.6609 679.6824 701.5937 729.0569 771.4478 781.3612 786.1292 789.0528 796.6879 805.5931 826.6637 839.7818 847.7107 880.4028 895.8913 897.6625 908.6471 916.0608 924.0473 951.9795 974.5548 998.5975 1002.5724 1026.1473 1031.8125 1035.2743 1044.5462 1053.1999 1070.8349 1078.7936 1083.3916 1109.8829 1120.8823 1126.6904 1138.1804 1152.7824 1176.6300 1198.7642 1213.7283 1227.7094 1240.0137 1242.0085 1244.5875 1254.6533 1260.7545 1278.2657 1287.8470 1303.6659 1304.0335 1308.8932 1332.3627 1337.4304 1340.3065 1349.9944 1359.2687 1361.9458 1365.4008 1380.4812 1389.6961 1429.0696 1450.8125 1464.5410 1464.7446 1466.4957 1468.8114 1473.2498 1473.7455 1475.8748 1477.2845 1482.0173 1485.1012 1577.7878 1600.4023 1612.4308 1619.9440 2970.0094 2971.2642 2972.8164 2973.9444 2974.0933 2978.9566 2986.3470 2988.6704 3003.0427 3012.0957 3024.4082 3035.1704 3036.7884 3044.8714 3045.2085 3055.5627 3065.8162 3069.7035 3070.6430 3074.6933 3136.8220 3151.7167 3166.6316 3181.3075
redmass: 2.3977 2.9310 4.0644 4.8303 4.7631 3.5505 3.6024 3.2653 4.1041 4.2762 4.0320 4.4521 4.8503 3.0575 2.1050 1.4201 2.9027 2.5700 3.2949 5.1733 4.5807 1.9166 5.6576 4.8937 3.8437 2.8455 3.7586 2.7416 2.8336 2.4136 3.7588 3.4194 6.4715 6.0074 6.0526 4.6802 1.3286 2.1563 3.9204 1.8847 1.4590 2.0998 3.2557 2.5080 2.4935 2.8269 1.7786 1.5954 1.4771 1.8280 3.5477 1.7352 1.2950 1.3999 2.7675 1.3501 3.3225 4.6976 3.3425 1.9597 1.0863 2.0779 2.8946 1.3866 2.6786 1.8774 2.0522 1.7883 2.3086 1.0597 1.5104 1.3056 3.2413 1.5490 1.3236 1.8987 1.2817 1.3245 1.5704 1.1053 1.2527 1.2842 1.3188 1.3603 1.5084 1.4598 1.5308 1.4143 1.4768 1.6463 10.1934 1.2176 2.2089 1.0815 1.0874 1.0890 1.0912 1.1313 1.0676 1.0742 2.3243 1.0562 1.0976 1.0766 7.3776 7.3063 9.2867 11.6167 1.0385 1.0653 1.0619 1.0586 1.0627 1.0634 1.0615 1.0644 1.0603 1.0829 1.0931 1.0955 1.0981 1.1004 1.1012 1.1021 1.1019 1.1010 1.1004 1.1063 1.0862 1.0912 1.0970 1.0971
irintensity: 0.2674 0.0104 0.3914 0.2293 1.8240 0.8804 0.5555 2.4597 0.5311 0.8400 0.6913 0.2833 3.7978 3.2454 0.3856 1.7788 2.6197 5.2082 1.2837 1.0476 2.4897 0.7819 10.6961 4.6190 1.8076 2.1192 2.0520 2.5521 6.4059 1.4030 2.0383 1.2080 5.2410 8.3943 4.8512 56.3520 7.8560 28.8442 1.6639 35.0121 1.7820 3.5462 0.1607 5.9129 9.9914 0.7868 2.8647 9.5907 9.8976 7.8952 25.7946 0.4242 6.0821 2.9730 79.3813 1.2828 26.9233 161.7583 95.7499 18.2139 0.8994 18.5416 221.4560 36.9018 1.5937 48.2923 12.5529 1.2409 1.1178 1.9021 2.4275 9.4714 176.6353 136.2557 14.7181 203.8592 7.0246 4.8412 43.7164 2.0677 15.9347 2.0242 0.9008 0.4717 1.3821 0.2645 0.8884 2.3513 3.0454 1.8773 8.7112 11.5384 6.7410 4.7071 2.0836 5.1205 17.9908 21.4212 8.4375 13.0513 10.9658 12.4956 2.1283 17.6009 27.9514 69.6773 149.3929 137.8554 33.4880 38.2448 35.1910 5.1927 33.0475 69.4155 11.0107 14.7884 18.8628 19.5615 10.0224 63.8510 62.1713 4.4705 39.6284 35.9637 56.9996 33.3376 73.3250 55.3564 1.7143 10.0760 16.3433 10.8390
temp: 298.150 k
press: 1.00000 atm
elementType: 8 8 8 8 6 6 6 6 6 6 6 6 6 6 6 6 6 6 6 6 6 6 1 1 1 1 1 1 1 1 1 1 1 1 1 1 1 1 1 1 1 1 1 1 1 1
symmnumber: 1
zpe: 1009297.8 jmol-1
zpe.correction: 0.384421 hartree
zpe.thermalcorrener: 0.405008 hartree
zpe.thermalcorrenthalpy: 0.405952 hartree
zpe.thermalcorrgfe: 0.333800 hartree
zpe.sumelectzpe: -999.562832 hartree
zpe.sumelectthermal: -999.542246 hartree
zpe.sumelectthermalent: -999.541302 hartree
zpe.sumelectthermalfe: -999.613454 hartree
dipole: -2.6805 -0.7372 -2.7345
dipole: 3.8995
quadrupole: -121.9467 -115.1334 -138.8678
quadrupole: -2.0623 -10.6707 4.2343
quadrupole: 3.3692 10.1826 -13.5519 -2.0623 -10.6707 4.2343
hfenergy: -999.9472537 hartree
pointgroup: C01 [X(C18H24O4)]
dipole: 0.9833257 -0.3941405 1.1097091 debye
polarizability: 254.1203486|9.0083648|216.5430939|-1.1528659|-26.9065831|152.8453548 unknown
InChI: InChI=1S/C18H24O4/c1-2-3-13-21-17(19)15-11-7-8-12-16(15)18(20)22-14-9-5-4-6-10-14/h7-8,11-12,14H,2-6,9-10,13H2,1H3
charge 0 multiplicity 1
46 atoms
O  0.959911 -1.355114 0.313728
O  0.034001 0.006767 -1.341988
O  -1.805263 1.818629 -0.113246
O  -3.336007 1.160098 -1.748048
C  2.340347 -1.075078 -0.213335
C  3.185144 -2.313991 0.112794
C  2.891273 0.201645 0.446025
C  4.658253 -2.084776 -0.31178
C  4.363917 0.429492 0.019614
C  5.239197 -0.806217 0.339218
C  -0.109007 -0.751655 -0.350574
C  -1.423548 -1.171276 0.232933
C  -2.609628 -0.431155 -0.04262
C  -1.51443 -2.381469 0.96763
C  -0.904932 4.066979 0.156346
C  -1.635106 3.132266 -0.807674
C  0.522036 3.599173 0.519859
C  -3.862136 -0.938898 0.37567
C  -2.61533 0.892098 -0.757762
C  -2.763932 -2.864162 1.407902
C  -3.943075 -2.147367 1.100486
C  1.242231 4.581667 1.467091
H  2.254873 -0.924473 -1.307351
H  2.763295 -3.200745 -0.395774
H  3.135837 -2.502085 1.203523
H  2.833529 0.08502 1.546482
H  2.265443 1.067469 0.165268
H  5.264227 -2.968532 -0.036115
H  4.714696 -1.991381 -1.415962
H  4.40418 0.634923 -1.069999
H  4.761872 1.328221 0.527664
H  6.276615 -0.639654 -0.008871
H  5.286101 -0.945754 1.439007
H  -0.596281 -2.939037 1.169664
H  -0.857295 5.068309 -0.319841
H  -1.508611 4.180572 1.078208
H  -2.634109 3.510474 -1.090398
H  -1.052978 2.938755 -1.728166
H  0.45983 2.598875 0.98776
H  1.11101 3.475605 -0.412055
H  -4.768149 -0.374657 0.132636
H  -2.819553 -3.800579 1.972967
H  -4.91908 -2.524906 1.423523
H  2.260721 4.229525 1.714316
H  0.686409 4.696781 2.416907
H  1.3342 5.58502 1.008943
