program: Gaussian 09
title: 000052932
version: EM64L-G09RevD.01
frameworkgroup: C1[X(C11H15NO5S)]
method: RPBEPBE
basis: SDD
operation: Freq
keyword: #p
keyword: freq=noraman
keyword: PBEPBE/SDD
title: #p freq=noraman PBEPBE/SDD
converged: YES YES NO NO
title: Mulliken charges:
elementType: S O O O O O N C C C C C C C C C C C H H H H H H H H H H H H H H H
charge: 0.954054 -0.534644 -0.536044 -0.257323 -0.265688 -0.241487 -0.218941 -0.294417 0.364756 -0.211417 -0.456827 0.355937 -0.354656 -0.618484 -0.608137 0.169439 -0.535757 -0.499071 0.307919 0.293891 0.257225 0.250003 0.248540 0.233774 0.278465 0.239243 0.235774 0.230140 0.226162 0.252648 0.255669 0.238743 0.240510
chargesum: 0.00000
title: Mulliken charges with hydrogens summed into heavy atoms:
elementType: S O O O O O N C C C C C C C C C C C
charge: 0.954054 -0.534644 -0.536044 -0.257323 -0.265688 -0.241487 -0.218941 -0.294417 0.364756 0.096502 -0.162936 0.355937 -0.097431 0.113833 0.145345 0.169439 0.173193 0.235851
polarizability: 2.46192465e+02 -7.35606954e+00 1.78774263e+02 -6.22343053e+00 -1.49380205e+00 1.17720967e+02
1716.lowfreq: -14.7123 -9.1111 -0.0003 0.0004 0.0013 2.2385 27.2933 40.2722 44.3531
frequency: 27.0600 39.6710 44.1617 72.7091 83.8145 92.1590 107.4552 112.8809 127.5594 141.7096 174.3340 182.6317 204.9144 215.3399 227.5096 233.0627 238.3192 250.0906 264.0667 286.9199 301.1782 308.5810 352.7897 377.0993 393.1933 404.7296 433.7049 453.8094 476.3464 518.9498 572.0921 585.4045 657.5839 696.1597 738.0576 750.6943 804.8036 829.5163 842.8113 851.1191 911.0057 926.0437 937.7796 970.6532 983.0385 1003.1778 1021.5462 1073.0759 1074.0595 1101.9609 1110.6530 1115.3424 1138.8041 1152.4979 1160.0167 1164.1015 1201.1347 1211.4061 1244.8809 1275.8471 1386.8282 1403.8763 1407.2039 1417.0873 1423.6984 1435.6908 1446.0158 1453.4860 1455.9907 1459.5654 1462.5956 1464.8013 1468.9863 1471.0894 1478.4624 1570.8795 1601.5921 1627.7149 2938.0085 2968.5934 2968.9982 3008.4092 3040.9188 3061.2333 3063.8130 3080.5609 3085.7540 3112.9445 3135.6865 3144.1438 3156.0579 3169.9794 3184.3727
redmass: 5.3274 4.0730 3.4646 3.7154 3.5027 3.0903 1.6695 2.1669 4.6494 4.2247 2.3652 2.1927 1.7583 2.9884 1.6483 2.6457 1.9122 4.4824 6.5050 3.1909 4.0134 5.0773 6.0864 4.8646 3.4329 7.2927 4.1533 5.3825 6.6113 4.7701 5.9088 5.0079 6.7078 4.2403 5.9705 4.9155 16.1568 1.4260 6.4854 4.4241 1.7555 5.4150 15.7490 1.3808 6.1667 4.9154 1.4302 2.2464 1.4579 1.3850 1.2596 1.2653 1.4183 1.4543 4.1249 1.3414 2.4241 1.7099 1.7334 3.1376 5.8087 3.9809 1.1364 1.1300 1.2283 1.3512 1.0475 1.0657 2.2236 1.0538 1.0552 1.0560 1.0504 1.0575 1.0549 6.5007 7.5092 9.7756 1.0397 1.0314 1.0326 1.0295 1.0929 1.1045 1.1013 1.1003 1.0997 1.1048 1.1000 1.0894 1.1051 1.0944 1.0923
irintensity: 1.5922 1.9850 2.3418 1.9400 4.9173 2.0016 0.2996 1.5479 4.8733 0.0727 0.0710 2.6140 0.4940 7.6873 0.8133 2.8876 2.8405 5.6524 1.4015 5.4736 10.6925 8.6465 9.5617 13.1120 5.8695 36.5814 17.9232 38.7940 35.9013 53.1176 3.8000 13.0093 2.4259 2.2336 20.1978 10.3894 67.7832 34.6335 3.8763 33.9766 20.5706 21.1970 77.2899 2.2683 1.9061 100.8862 0.8861 103.2272 38.7660 50.4941 0.1226 0.9947 1.9044 27.8934 6.9484 35.2420 212.5238 9.4872 80.7794 295.5044 7.2443 17.3669 12.9804 16.9493 42.2703 24.1816 29.7828 20.3183 37.3319 2.4420 12.1087 7.8803 15.4684 38.2355 32.0359 122.5100 83.8479 115.7210 42.3472 66.6098 38.8668 30.4847 20.6172 39.1710 13.3454 6.1910 15.5026 19.5667 19.1992 9.2802 13.5255 13.6663 1.3110
temp: 298.150 k
press: 1.00000 atm
elementType: 16 8 8 8 8 8 7 6 6 6 6 6 6 6 6 6 6 6 1 1 1 1 1 1 1 1 1 1 1 1 1 1 1
symmnumber: 1
zpe: 650810.7 jmol-1
zpe.correction: 0.247881 hartree
zpe.thermalcorrener: 0.268441 hartree
zpe.thermalcorrenthalpy: 0.269385 hartree
zpe.thermalcorrgfe: 0.198006 hartree
zpe.sumelectzpe: -1255.519136 hartree
zpe.sumelectthermal: -1255.498575 hartree
zpe.sumelectthermalent: -1255.497631 hartree
zpe.sumelectthermalfe: -1255.569010 hartree
dipole: 5.3427 2.5085 4.5163
dipole: 7.4320
quadrupole: -95.8646 -105.4740 -119.2296
quadrupole: -18.3238 -8.8378 -6.9892
quadrupole: 10.9914 1.3821 -12.3736 -18.3238 -8.8378 -6.9892
hfenergy: -1255.7670163 hartree
pointgroup: C01 [X(C11H15N1O5S1)]
dipole: 2.0685594 -1.1896153 -1.6898149 debye
polarizability: 242.6101797|-9.3227939|178.6402466|21.1650034|3.9083579|121.4372682 unknown
InChI: InChI=1S/C11H15NO5S/c1-12(2)18(14,15)10-6-5-8(16-3)7-9(10)11(13)17-4/h5-7H,1-4H3
charge 0 multiplicity 1
33 atoms
S  -1.482638 1.639219 0.757849
O  -2.372438 0.591728 1.634208
O  -1.048588 3.067522 1.403797
O  4.089416 -0.831945 0.163554
O  -0.49412 -2.747767 -0.029686
O  -1.743194 -1.027886 -0.975742
N  -2.504181 2.138274 -0.78848
C  0.238953 0.824715 0.37339
C  0.419295 -0.541092 0.034993
C  1.329556 1.665059 0.636988
C  1.734181 -1.051669 -0.006992
C  2.844783 -0.209111 0.248618
C  2.645425 1.158544 0.562876
C  -1.61427 2.327604 -1.956244
C  -3.667809 1.24852 -1.005203
C  -0.720335 -1.420353 -0.36637
C  5.28245 -0.020772 0.438915
C  -1.57374 -3.69478 -0.405586
H  1.133638 2.700115 0.937604
H  1.905784 -2.103382 -0.24854
H  3.486998 1.825939 0.767442
H  -0.770851 2.984751 -1.682786
H  -2.208126 2.85221 -2.727542
H  -1.233335 1.376966 -2.387698
H  -3.961286 0.802345 -0.038114
H  -3.474243 0.43144 -1.72326
H  -4.497648 1.890058 -1.357849
H  5.264792 0.376164 1.471639
H  5.374343 0.812467 -0.283663
H  6.128905 -0.711671 0.319744
H  -2.517418 -3.396629 0.079817
H  -1.227381 -4.670332 -0.038533
H  -1.710417 -3.70315 -1.500046
