program: Gaussian 09
title: 000053466
version: EM64L-G09RevD.01
frameworkgroup: C1[X(C16H13N3O2)]
method: RPBEPBE
basis: SDD
operation: Freq
keyword: #p
keyword: freq=noraman
keyword: PBEPBE/SDD
title: #p freq=noraman PBEPBE/SDD
converged: YES YES NO NO
title: Mulliken charges:
elementType: O O N N N C C C C C C C C C C C C C C C C H H H H H H H H H H H H H
charge: -0.268665 -0.212867 -0.249507 -0.092962 -0.099290 0.386611 0.383072 -0.062116 0.195451 -0.242021 -0.353480 -0.495227 -0.400343 0.345187 -0.324729 -0.216411 -0.213158 -0.366653 -0.233629 -0.185456 -0.536799 0.286358 0.253634 0.281935 0.272806 0.281829 0.239605 0.225239 0.243155 0.242141 0.228508 0.220845 0.220221 0.246714
chargesum: 0.00000
title: Mulliken charges with hydrogens summed into heavy atoms:
elementType: O O N N N C C C C C C C C C C C C C C C C
charge: -0.268665 -0.212867 -0.249507 -0.092962 -0.099290 0.386611 0.383072 -0.062116 0.195451 0.044337 -0.099846 -0.213292 -0.127537 0.345187 -0.042900 0.023194 0.012081 -0.123498 0.008512 0.043052 0.150982
polarizability: 3.35756112e+02 9.34594149e-01 2.15441033e+02 -1.88015633e+01 1.66032215e+00 1.02400484e+02
1716.lowfreq: -5.8276 -1.2493 -0.0013 -0.0010 -0.0006 4.2567 22.5810 37.1509 43.7731
frequency: 22.5737 37.1228 43.7722 72.0769 91.5069 100.2993 111.4517 135.3066 190.5861 200.6263 216.5638 240.7712 258.4691 262.5047 274.1525 316.4981 342.0182 379.6755 422.5888 453.1317 455.6844 483.8326 512.7392 545.9139 558.6315 581.3598 625.3195 637.8079 669.6164 695.0255 702.3726 726.6104 742.9816 777.2425 799.1926 810.2620 816.6078 818.7904 886.9759 896.8207 915.7054 929.4775 954.6472 960.5980 980.8862 982.8280 984.5869 1005.7319 1010.8595 1013.2519 1049.1491 1079.7586 1092.3917 1093.3397 1112.1147 1155.1773 1171.9570 1178.3645 1182.4775 1196.8527 1210.8674 1232.2932 1248.3064 1280.7449 1293.9799 1340.2270 1381.3657 1391.1961 1396.9568 1401.8747 1425.4913 1434.1501 1443.3538 1458.7874 1466.7347 1474.5539 1480.3980 1513.9006 1571.9549 1585.8519 1590.9668 1617.4779 1625.1229 2957.7653 2997.8300 3045.1508 3125.4643 3136.7443 3138.7364 3147.2657 3158.5583 3163.7618 3170.2440 3173.2902 3177.0877 3247.0148
redmass: 6.1212 5.0584 5.6794 4.0564 5.3896 4.1960 4.6128 4.8949 3.3733 1.6001 6.1764 3.7662 4.6918 2.1441 4.1684 4.9831 6.6533 6.7281 6.8101 3.0976 3.1087 5.8530 4.4713 4.8239 4.5456 5.3621 6.0353 4.4544 7.0130 2.1981 6.2990 3.4826 5.0623 1.3041 1.6013 5.7973 3.5124 1.6379 1.3439 1.4015 1.5571 8.0022 5.4077 1.8178 5.8475 1.3320 1.5052 6.7422 1.4618 3.9593 2.0749 2.0889 1.7861 2.0437 1.2597 1.3597 1.6152 1.1391 1.6176 1.9632 2.5764 2.3994 4.9106 1.6363 1.4853 3.0627 2.4696 7.3391 3.1537 2.7887 2.3399 1.5688 2.7514 2.0943 1.0523 1.1477 2.7734 5.4167 7.7265 6.2450 6.3272 6.5244 6.6411 1.0331 1.0889 1.1039 1.0991 1.0873 1.0859 1.0896 1.0948 1.0924 1.0924 1.1010 1.0973 1.0998
irintensity: 1.5192 1.5644 0.8768 5.2495 3.7244 8.3778 2.8138 1.1967 4.5688 0.2590 2.0271 6.1492 1.8005 0.8489 2.0546 3.8037 1.9667 6.0857 0.5473 8.2771 2.6117 3.1259 4.4800 11.1640 2.3949 4.3370 6.5582 3.5137 1.3674 15.1148 15.6076 2.7926 31.6693 83.1801 42.3544 6.1274 40.6915 12.3390 0.0318 0.3998 25.7744 1.3825 50.8560 19.3889 6.0224 1.4184 5.5576 95.2762 1.5100 13.3091 9.6708 13.5673 16.8754 1.3815 0.2124 1.3892 7.1047 7.0629 8.8449 57.6574 58.5372 97.8495 57.7543 34.1554 45.7882 1.9234 24.4173 43.1599 25.1737 29.0483 74.5032 23.7670 102.8997 132.5615 13.1980 7.8103 92.7791 61.1188 75.0432 50.9701 123.6853 52.3779 39.3073 76.2041 37.0841 49.5492 23.8191 12.4106 2.3091 4.0319 9.4227 12.6764 0.5084 21.2501 10.7764 1.2993
temp: 298.150 k
press: 1.00000 atm
elementType: 8 8 7 7 7 6 6 6 6 6 6 6 6 6 6 6 6 6 6 6 6 1 1 1 1 1 1 1 1 1 1 1 1 1
symmnumber: 1
zpe: 672726.6 jmol-1
zpe.correction: 0.256228 hartree
zpe.thermalcorrener: 0.273936 hartree
zpe.thermalcorrenthalpy: 0.274880 hartree
zpe.thermalcorrgfe: 0.208774 hartree
zpe.sumelectzpe: -930.706773 hartree
zpe.sumelectthermal: -930.689065 hartree
zpe.sumelectthermalent: -930.688121 hartree
zpe.sumelectthermalfe: -930.754227 hartree
dipole: 0.7786 -2.7624 -1.5295
dipole: 3.2521
quadrupole: -72.1741 -128.0021 -125.9624
quadrupole: -15.9550 -6.0091 -3.6103
quadrupole: 36.5387 -19.2893 -17.2495 -15.9550 -6.0091 -3.6103
hfenergy: -930.9630011 hartree
pointgroup: C01 [X(C16H13N3O2)]
dipole: -0.3168564 -1.0629374 0.6378441 debye
polarizability: 336.2846178|-1.6137671|215.1520718|-15.0973101|-5.9766485|102.1609397 unknown
InChI: InChI=1S/C16H13N3O2/c1-21-14-7-4-6-12(9-14)16-17-11-19(18-16)15-8-3-2-5-13(15)10-20/h2-11H,1H3
charge 0 multiplicity 1
34 atoms
O  4.300472 2.008576 0.567329
O  -2.456296 3.032942 -1.502514
N  -1.502626 -0.920696 -0.114339
N  -0.307354 -0.194181 0.039638
N  0.130707 -2.423366 -0.450593
C  -2.792314 -0.326989 0.073055
C  2.093271 -0.867116 -0.105051
C  0.652227 -1.147599 -0.169141
C  -3.09848 0.994931 -0.369967
C  -1.199772 -2.246788 -0.404694
C  -3.779468 -1.107412 0.724288
C  2.5596 0.432805 0.199292
C  3.019274 -1.918503 -0.351515
C  3.94941 0.685738 0.257156
C  -4.404436 1.501729 -0.128106
C  -5.072855 -0.58824 0.932141
C  4.399412 -1.651417 -0.290276
C  4.881175 -0.355624 0.012459
C  -5.387999 0.726692 0.511711
C  -2.147418 1.867184 -1.131303
C  5.726207 2.333847 0.638395
H  -1.950777 -3.006086 -0.602718
H  -3.523516 -2.103749 1.098981
H  1.859049 1.249762 0.394468
H  2.639544 -2.916898 -0.585035
H  -4.612444 2.51946 -0.476685
H  -5.824504 -1.200735 1.441232
H  5.117257 -2.457111 -0.479651
H  5.959046 -0.173323 0.0543
H  -6.387771 1.136536 0.686581
H  -1.153244 1.437202 -1.365879
H  6.229762 2.158921 -0.33258
H  6.234943 1.750202 1.43057
H  5.763022 3.404707 0.886351
