program: Gaussian 09
title: 000052999
version: EM64L-G09RevD.01
frameworkgroup: C1[X(C14H15N5O6S)]
method: RPBEPBE
basis: SDD
operation: Freq
keyword: #p
keyword: freq=noraman
keyword: PBEPBE/SDD
title: #p freq=noraman PBEPBE/SDD
converged: YES YES NO NO
title: Mulliken charges:
elementType: S O O O O O O N N N N N C C C C C C C C C C C C C C H H H H H H H H H H H H H H H
charge: 1.020150 -0.483924 -0.519876 -0.294534 -0.228824 -0.204868 -0.202818 -0.660507 -0.413219 -0.114217 -0.057157 -0.012471 -0.160956 0.307780 -0.195494 -0.335723 -0.226370 -0.212815 0.180372 0.349446 0.084725 0.059230 0.055238 -0.515175 -0.738289 -0.503250 0.311133 0.358357 0.278065 0.251314 0.246455 0.348826 0.248446 0.246271 0.244310 0.265944 0.268497 0.224225 0.233961 0.239589 0.258155
chargesum: 0.00000
title: Mulliken charges with hydrogens summed into heavy atoms:
elementType: S O O O O O O N N N N N C C C C C C C C C C C C C C
charge: 1.020150 -0.483924 -0.519876 -0.294534 -0.228824 -0.204868 -0.202818 -0.302150 -0.064393 -0.114217 -0.057157 -0.012471 -0.160956 0.307780 0.115638 -0.057658 0.024944 0.033640 0.180372 0.349446 0.084725 0.059230 0.055238 0.243490 0.000738 0.228456
polarizability: 2.78806638e+02 -1.84909249e+01 2.69270560e+02 5.35468277e+00 1.16817982e+00 1.78154513e+02
1716.lowfreq: -4.9345 -0.0015 -0.0009 -0.0005 2.9845 4.2869 13.4292 17.5069 27.6567
frequency: 13.3019 17.4965 27.6507 38.6260 48.9627 56.6267 62.7884 70.8211 73.0415 91.8346 102.4768 108.8045 116.9609 123.5456 132.0958 158.1924 172.9839 186.3608 212.7216 214.7746 223.6214 229.0754 230.2082 253.1674 269.6166 285.2216 303.7406 324.2695 327.6465 356.8161 377.8254 384.3436 427.1537 452.5094 484.1514 496.9621 526.3347 543.6001 569.0752 603.0941 608.3923 627.6750 655.8756 670.3692 674.1954 676.8144 724.8383 737.0070 743.4104 767.5765 772.5495 788.1368 807.1949 823.2795 892.7692 897.0118 901.1662 908.3461 944.9964 965.8623 979.6207 981.7775 987.1847 1007.9186 1030.5194 1044.4831 1052.3215 1078.0932 1082.7373 1113.9855 1115.3937 1121.6141 1128.6330 1155.7549 1162.1235 1178.7966 1209.0054 1244.8660 1271.6339 1277.0805 1311.1201 1357.5382 1373.2044 1376.6465 1396.5240 1410.7224 1423.5522 1437.8995 1449.0744 1452.0133 1453.9483 1454.2364 1459.3015 1459.4604 1475.5535 1481.7887 1497.2981 1520.9055 1563.1096 1604.1325 1632.8237 1647.0010 3002.8194 3008.6638 3010.3527 3086.0758 3116.4956 3123.4875 3136.3743 3142.1257 3146.9652 3153.3235 3159.9507 3170.0963 3180.4061 3520.8795 3527.0710
redmass: 5.1852 6.6546 4.9552 6.2794 1.1001 3.3506 6.3339 2.6452 1.8405 3.2488 2.7093 3.8810 2.8497 1.9307 4.2732 5.8001 7.9067 5.1406 7.8075 6.7843 5.1171 5.6567 4.9198 5.4884 8.3812 4.3873 5.1641 5.8073 1.6788 6.4082 6.2625 4.5499 4.7783 9.6240 4.6986 6.0513 5.1131 7.0182 6.9001 3.7346 4.0598 6.7144 1.5142 5.7184 6.5633 6.9856 5.6065 5.8002 3.6114 5.7870 3.3487 1.6907 8.8309 15.9961 8.0703 1.6262 13.4228 4.4577 8.6191 8.0422 1.4610 2.1761 7.4193 1.3702 3.3886 5.3832 1.6538 2.5605 2.5590 1.2571 1.5065 1.4788 1.8563 1.4982 1.7858 1.0654 5.3777 2.6646 1.6595 2.3709 2.8465 3.5956 2.3478 5.9147 1.4419 1.1947 2.3139 1.7510 1.0930 1.3379 1.0552 1.0679 1.9051 1.2137 1.0531 2.3298 7.0359 3.0545 5.9220 7.0616 10.3690 8.9980 1.0378 1.0281 1.0290 1.0962 1.1046 1.1053 1.1005 1.1059 1.0868 1.1059 1.0906 1.0948 1.1004 1.0779 1.0767
irintensity: 0.3462 0.0750 0.2338 2.6545 0.2134 0.7927 4.1154 14.4697 3.9843 4.2367 2.1400 3.1250 6.2777 0.8957 1.9159 3.2426 1.4867 1.0218 3.1003 2.7436 1.5821 3.5589 1.8596 9.7091 1.0634 10.6485 22.2925 9.0380 89.0602 21.5301 35.2087 1.3443 3.8936 125.4866 19.6111 13.3248 7.0309 21.5829 117.2168 12.5775 17.2447 7.1477 72.2110 32.7757 9.2182 10.3287 18.4179 69.9049 5.0184 28.0834 59.9300 23.8954 23.9052 144.8618 5.3174 8.5546 9.0800 11.3921 23.2872 60.7008 6.0096 17.9545 11.3647 0.6530 47.1449 33.9540 7.6783 47.8204 99.4525 2.2939 3.5543 34.2413 393.4847 11.8253 56.3552 0.2617 8.6453 205.3990 38.1056 218.7331 379.3467 215.5305 281.8670 8.3809 150.8085 52.0391 23.6741 114.0497 91.7374 229.9535 11.0988 54.1667 9.0890 29.3741 12.5950 588.7721 380.3588 380.9319 5.3281 13.8028 213.9095 175.0667 3.4043 26.0844 28.1778 7.7758 19.9724 10.6438 10.1547 9.9863 3.6793 22.0843 4.7632 2.4931 16.1851 20.0696 71.4615
temp: 298.150 k
press: 1.00000 atm
elementType: 16 8 8 8 8 8 8 7 7 7 7 7 6 6 6 6 6 6 6 6 6 6 6 6 6 6 1 1 1 1 1 1 1 1 1 1 1 1 1 1 1
symmnumber: 1
zpe: 761019.1 jmol-1
zpe.correction: 0.289857 hartree
zpe.thermalcorrener: 0.316789 hartree
zpe.thermalcorrenthalpy: 0.317733 hartree
zpe.thermalcorrgfe: 0.228718 hartree
zpe.sumelectzpe: -1663.573193 hartree
zpe.sumelectthermal: -1663.546261 hartree
zpe.sumelectthermalent: -1663.545317 hartree
zpe.sumelectthermalfe: -1663.634332 hartree
dipole: 0.0405 1.0605 -3.8965
dipole: 4.0385
quadrupole: -180.8002 -129.9993 -168.2313
quadrupole: -22.9858 8.5072 6.7493
quadrupole: -21.1233 29.6777 -8.5544 -22.9858 8.5072 6.7493
hfenergy: -1663.86305 hartree
pointgroup: C01 [X(C14H15N5O6S1)]
dipole: -0.0677046 0.0169698 -1.5873194 debye
polarizability: 278.7088923|-15.2292193|262.3944883|-13.7478978|23.2252995|185.1283307 unknown
InChI: InChI=1S/C14H15N5O6S/c1-8-15-12(18-14(16-8)25-3)17-13(21)19-26(22,23)10-7-5-4-6-9(10)11(20)24-2/h4-7,17,19H,1-3H3
charge 0 multiplicity 1
41 atoms
S  2.293382 0.546126 1.656982
O  2.137357 -0.350782 2.988923
O  3.208403 1.881732 1.689084
O  2.434423 2.028373 -1.034439
O  4.461847 1.645968 -2.126888
O  -0.370875 -0.95366 1.096577
O  -4.500146 -2.07088 -1.215361
N  0.616744 1.175544 1.205068
N  -1.678858 1.039091 0.965216
N  -3.941031 1.490452 0.705611
N  -3.016051 -0.583491 -0.167567
N  -5.391482 -0.098227 -0.416496
C  2.790546 -0.639091 0.231699
C  3.349782 -0.189871 -0.985632
C  2.654026 -1.993159 0.569337
C  3.822339 -1.188021 -1.879805
C  3.103786 -2.963388 -0.354126
C  3.69603 -2.557862 -1.571613
C  3.510269 1.233856 -1.427609
C  -0.473222 0.294008 1.074993
C  -2.914168 0.604334 0.482435
C  -5.162506 1.089265 0.226661
C  -4.284582 -0.8815 -0.5773
C  2.592255 3.491947 -1.242801
C  -6.338483 2.003749 0.426386
C  -3.322859 -2.959629 -1.393775
H  2.216175 -2.270073 1.532733
H  0.661032 2.088548 0.740292
H  4.288077 -0.858252 -2.813857
H  2.999485 -4.02578 -0.113218
H  4.061831 -3.30791 -2.280099
H  -1.712935 1.974564 1.381198
H  -7.090797 1.513742 1.070269
H  -6.830926 2.204792 -0.540838
H  -6.017703 2.947489 0.890569
H  3.21679 3.684787 -2.129059
H  3.065848 3.908323 -0.338312
H  1.574917 3.886649 -1.380906
H  -3.746668 -3.874865 -1.829901
H  -2.593108 -2.491032 -2.074504
H  -2.835449 -3.154465 -0.425031
