program: Gaussian 09
title: 000052938
version: EM64L-G09RevD.01
frameworkgroup: C1[X(C18H18ClNO2)]
method: RPBEPBE
basis: SDD
operation: Freq
keyword: #p
keyword: freq=noraman
keyword: PBEPBE/SDD
title: #p freq=noraman PBEPBE/SDD
converged: YES YES NO NO
title: Mulliken charges:
elementType: Cl O O N C C C C C C C C C C C C C C C C C C H H H H H H H H H H H H H H H H H H
charge: -0.061399 -0.249937 -0.435237 -0.083128 0.132872 0.027123 0.240486 0.105095 -0.476153 0.187858 0.152813 -0.368420 0.348499 -0.425377 -0.799813 -0.398984 -0.406340 -0.614751 -0.613821 -0.227719 -0.226606 -0.116489 0.219274 0.222918 0.250966 0.215145 0.255443 0.253517 0.241200 0.252010 0.256457 0.221998 0.184455 0.225942 0.189637 0.214066 0.240512 0.254926 0.255219 0.355744
chargesum: 0.00000
title: Mulliken charges with hydrogens summed into heavy atoms:
elementType: Cl O O N C C C C C C C C C C C C C C C C C C
charge: -0.061399 -0.249937 -0.079493 -0.083128 0.132872 0.027123 0.240486 0.105095 -0.033960 0.187858 0.152813 -0.117453 0.348499 -0.210232 -0.049653 -0.146974 -0.149883 0.017645 0.030393 0.027207 0.028613 -0.116489
polarizability: 3.41822064e+02 2.18565955e+00 2.23575080e+02 5.78256487e+00 -1.51832577e+01 1.27437523e+02
1716.lowfreq: -8.7801 -7.1175 -3.4891 -0.0022 -0.0022 -0.0020 23.3854 33.1815 35.1076
frequency: 22.6998 32.9549 35.0654 50.1570 57.3197 79.2783 109.8480 126.5028 150.2958 174.8097 176.6353 201.8774 210.2885 232.4064 245.5857 258.4292 270.8673 299.8269 311.6326 317.3242 322.3021 351.1744 355.4944 397.5248 412.6600 415.1065 423.3385 465.5700 480.3371 500.3579 533.6001 573.2708 581.0457 610.6377 621.2622 636.9673 675.9115 707.8233 716.3893 744.1095 757.6465 791.2331 812.4619 823.7807 832.0460 846.4635 891.1228 920.7185 922.6019 954.1298 969.2410 994.2396 1007.2811 1015.6235 1020.7651 1034.0095 1043.1866 1051.1968 1074.5820 1088.4290 1109.5800 1132.2685 1149.7309 1162.2185 1168.6504 1187.1575 1195.2692 1226.5924 1245.0029 1252.3952 1264.3244 1286.6468 1294.8189 1345.1031 1363.0430 1374.8806 1393.2868 1397.8081 1406.6395 1415.4046 1433.2918 1439.1042 1456.5263 1457.1577 1460.3897 1466.9131 1471.2862 1472.1690 1482.3975 1484.3838 1503.3304 1570.9924 1596.2455 1606.9113 1619.8170 1631.5928 2842.0317 2864.0066 2897.1739 2979.0098 3014.8554 3022.7841 3026.4998 3058.6122 3074.6133 3086.3363 3103.2032 3114.6681 3144.7885 3146.4255 3161.7762 3169.4090 3173.0923 3587.2962
redmass: 3.8666 3.5093 4.0989 4.6329 4.1032 4.0897 4.4977 3.6155 1.5345 3.2351 3.9210 4.0926 2.4578 1.1435 1.5212 5.3057 3.4377 3.1426 2.8822 4.7629 1.2640 4.7511 2.2400 5.3271 3.8743 3.9509 2.5557 4.5116 6.1078 3.3959 4.0174 4.7449 5.5254 5.0123 5.9296 5.5147 4.6631 6.5805 4.2436 5.5914 7.8915 1.5284 5.0970 2.3302 1.2771 2.3893 3.1867 2.2560 1.5708 1.3333 1.3685 3.9331 2.8878 2.3048 2.2190 1.5859 1.4681 3.1357 2.5472 1.2609 1.3760 1.3940 2.0084 1.6055 1.7580 1.1395 2.7585 2.5722 2.4046 2.4276 5.6904 1.4729 1.2700 4.1554 1.4204 3.8103 2.5484 3.4169 1.6260 1.1470 3.4454 1.3000 1.0529 1.0491 1.0776 1.1381 1.0827 1.0628 2.3662 1.0644 3.7006 7.3618 6.7415 7.8038 7.8749 8.9552 1.0573 1.0567 1.0683 1.0397 1.0712 1.0865 1.0772 1.0948 1.1010 1.1000 1.0984 1.0890 1.0888 1.0888 1.0946 1.0960 1.0971 1.0661
irintensity: 0.2515 0.4220 0.3998 0.7638 0.4499 0.4638 3.7571 0.8780 0.6019 4.1126 0.5966 0.5754 1.3635 0.5107 1.2751 0.2184 4.0794 2.9389 22.3064 2.7792 96.7817 0.4535 8.2274 13.4821 3.2633 5.7662 0.1536 1.3186 19.6189 16.2197 3.0341 12.5490 0.8164 8.9676 5.4942 4.2032 13.2282 14.8753 1.0616 7.2290 2.1199 38.6527 21.6806 34.1404 0.0779 31.4260 14.7859 49.5524 18.2905 0.3517 6.0413 85.1745 56.5440 86.0332 61.6435 13.3917 5.4475 27.8599 57.3551 7.4721 7.1063 18.1834 4.7398 80.6068 20.2236 0.9212 36.2602 33.4460 70.3989 10.7493 13.7344 3.4347 1.9517 5.7352 17.0364 11.7059 46.9944 2.1555 52.7140 2.7442 0.1263 3.9890 10.3299 15.9596 4.0457 4.1249 9.6059 17.6065 77.4428 14.1978 57.3206 2.9553 18.4517 1.0330 53.3092 34.8533 127.5971 151.1912 93.9579 26.7628 39.5946 27.6138 27.7526 10.5639 31.9956 44.9279 11.1782 19.9863 4.2039 11.0161 7.0759 9.1485 0.3574 48.4252
temp: 298.150 k
press: 1.00000 atm
elementType: 17 8 8 7 6 6 6 6 6 6 6 6 6 6 6 6 6 6 6 6 6 6 1 1 1 1 1 1 1 1 1 1 1 1 1 1 1 1 1 1
symmnumber: 1
zpe: 823804.5 jmol-1
zpe.correction: 0.313771 hartree
zpe.thermalcorrener: 0.334947 hartree
zpe.thermalcorrenthalpy: 0.335891 hartree
zpe.thermalcorrgfe: 0.262368 hartree
zpe.sumelectzpe: -1360.372207 hartree
zpe.sumelectthermal: -1360.351031 hartree
zpe.sumelectthermalent: -1360.350087 hartree
zpe.sumelectthermalfe: -1360.423610 hartree
dipole: -1.5262 -0.9833 -0.4783
dipole: 1.8775
quadrupole: -148.3262 -115.6092 -137.0746
quadrupole: 8.0580 -1.6587 -4.5411
quadrupole: -14.6562 18.0608 -3.4046 8.0580 -1.6587 -4.5411
hfenergy: -1360.6859777 hartree
pointgroup: C01 [X(C18H18Cl1N1O2)]
dipole: 0.6170189 -0.405643 0.0187392 debye
polarizability: 341.9602307|2.3337039|200.2996838|-1.7675478|43.9277558|150.5747523 unknown
InChI: InChI=1S/C18H18ClNO2/c1-11-17(12-4-6-13(19)7-5-12)14-8-9-16(21)15(10-20(2)3)18(14)22-11/h4-9,21H,10H2,1-3H3
charge 0 multiplicity 1
40 atoms
Cl -7.014196 -0.487717 -0.408112
O  1.057344 1.371573 0.80127
O  3.844583 -2.426257 -0.521331
N  4.251773 1.280996 -0.50768
C  0.079879 -0.5521 -0.035253
C  1.311573 0.087042 0.281212
C  2.590822 -0.477709 0.136964
C  -0.986207 0.394413 0.307222
C  3.855885 0.269785 0.513413
C  -0.358181 1.531424 0.804466
C  2.585924 -1.806948 -0.359868
C  0.124684 -1.881041 -0.521247
C  -2.438876 0.18471 0.143679
C  1.380924 -2.49763 -0.680185
C  -0.836614 2.867225 1.269564
C  -3.369266 0.628468 1.125185
C  -2.949371 -0.479646 -1.007589
C  5.274451 2.205142 0.019163
C  4.656044 0.674864 -1.792062
C  -4.75772 0.43372 0.963743
C  -4.333848 -0.686724 -1.182566
C  -5.220827 -0.223497 -0.191729
H  3.671963 0.820685 1.454738
H  4.671264 -0.469062 0.701305
H  -0.790694 -2.434242 -0.750931
H  1.434711 -3.529561 -1.051157
H  -0.210762 3.66739 0.835942
H  -1.881525 3.030338 0.959415
H  -0.781914 2.967814 2.370659
H  -3.003342 1.103079 2.041691
H  -2.25936 -0.806941 -1.792243
H  5.490925 2.98292 -0.735154
H  6.242108 1.703027 0.281046
H  4.891746 2.705901 0.926758
H  5.564916 0.026967 -1.706763
H  4.864781 1.476001 -2.52402
H  3.83495 0.052995 -2.186589
H  -5.462309 0.773977 1.728037
H  -4.715019 -1.189739 -2.07593
H  3.733881 -3.353141 -0.847263
