program: Gaussian 09
title: 000052897
version: EM64L-G09RevD.01
frameworkgroup: C1[X(C12H13NO2)]
method: RPBEPBE
basis: SDD
operation: Freq
keyword: #p
keyword: freq=noraman
keyword: PBEPBE/SDD
title: #p freq=noraman PBEPBE/SDD
converged: YES YES NO NO
title: Mulliken charges:
elementType: O O N C C C C C C C C C C C C H H H H H H H H H H H H H
charge: -0.414984 -0.227885 -0.408496 0.149061 0.057748 0.327500 0.418306 -0.637429 -0.399468 0.494425 -0.616348 -0.572517 -0.830819 -0.830634 0.206363 0.262446 0.313298 0.268253 0.244103 0.233203 0.228817 0.224192 0.225530 0.237024 0.224574 0.223888 0.224500 0.375347
chargesum: 0.00000
title: Mulliken charges with hydrogens summed into heavy atoms:
elementType: O O N C C C C C C C C C C C C
charge: -0.039637 -0.227885 -0.095198 0.149061 0.057748 0.327500 0.418306 -0.374983 -0.131216 0.494425 -0.139041 -0.343700 -0.144073 -0.157672 0.206363
polarizability: 1.74202411e+02 -1.14695517e+01 1.70362770e+02 -9.07811890e+00 -1.29119876e+00 8.42640566e+01
1716.lowfreq: -9.3043 -3.6031 -0.0013 -0.0011 -0.0009 5.2389 26.7214 48.3917 59.1623
frequency: 26.5390 48.2634 59.1589 62.9818 114.3971 131.3839 149.6082 164.5720 217.0002 246.5265 296.3301 316.8587 366.7333 396.8260 446.9530 472.7802 486.5666 513.0828 519.4907 556.4102 573.6471 592.4479 609.0208 641.6288 674.7603 750.1493 774.3741 792.9004 820.8731 847.9082 862.6909 895.5426 923.3150 931.6797 963.2080 998.0803 1016.5863 1042.2543 1048.4983 1050.1372 1098.5426 1129.7981 1176.8024 1216.1262 1234.0490 1262.8109 1279.8365 1313.2320 1316.1391 1343.8241 1391.1153 1394.2870 1396.8379 1403.2885 1444.7226 1450.6071 1465.5060 1470.3516 1471.3983 1485.4095 1500.0198 1561.8175 1608.1128 1633.0687 1668.3535 2959.7775 2970.3627 3021.8279 3029.6698 3045.7988 3080.2004 3084.4969 3089.7009 3110.3933 3141.0598 3224.1373 3505.7967 3616.7574
redmass: 6.8477 6.8384 1.0460 5.0704 1.0368 4.0581 3.6890 3.7584 3.2014 2.6255 4.3651 3.2478 5.3039 2.5348 4.7407 3.7704 1.5552 3.5340 2.1409 3.8978 3.4615 2.6502 2.1005 2.5850 2.8056 3.8555 4.3211 1.7431 4.3388 3.9517 1.4345 1.4320 2.2053 3.0274 3.2081 2.1650 1.4508 1.5046 1.8215 1.6759 1.5033 2.0473 1.3473 2.1554 1.9787 1.5132 1.7762 2.2793 1.9683 2.7481 2.7694 1.9088 1.2813 1.8841 2.9574 1.1094 1.4883 1.0475 1.0455 1.2762 2.1870 6.0612 6.4205 6.7704 8.5125 1.0386 1.0373 1.0589 1.0977 1.0977 1.0982 1.0963 1.1034 1.0909 1.0923 1.0987 1.0638 1.0807
irintensity: 1.4923 1.2711 0.5696 0.4948 0.6073 1.4623 5.6868 1.4615 0.0091 0.1809 1.1349 1.1763 0.8286 3.8412 5.1891 6.7400 74.6976 12.3366 21.3987 29.7109 1.3462 13.5562 61.2716 45.0318 87.1515 7.7765 0.1489 21.3845 2.2644 19.3846 23.9787 6.1380 14.4222 10.0559 8.2255 5.6815 3.8113 2.1820 102.7829 75.6206 54.3374 1.0581 17.3845 9.9693 2.7670 0.7975 5.2441 7.8262 27.2985 37.0728 22.5870 26.7594 5.1537 3.1469 6.1598 22.4255 12.9721 20.7461 5.7960 15.6786 14.1629 2.3190 12.5959 1.9566 255.4873 50.1028 50.4759 21.3568 25.8367 25.3726 18.7858 16.7660 5.6524 22.4257 5.7980 0.4562 16.9161 58.8271
temp: 298.150 k
press: 1.00000 atm
elementType: 8 8 7 6 6 6 6 6 6 6 6 6 6 6 6 1 1 1 1 1 1 1 1 1 1 1 1 1
symmnumber: 1
zpe: 586159.4 jmol-1
zpe.correction: 0.223256 hartree
zpe.thermalcorrener: 0.237753 hartree
zpe.thermalcorrenthalpy: 0.238697 hartree
zpe.thermalcorrgfe: 0.180447 hartree
zpe.sumelectzpe: -669.220076 hartree
zpe.sumelectthermal: -669.205579 hartree
zpe.sumelectthermalent: -669.204635 hartree
zpe.sumelectthermalfe: -669.262885 hartree
dipole: -1.9692 -1.1284 -0.5153
dipole: 2.3273
quadrupole: -87.2025 -72.2798 -91.3445
quadrupole: 7.8510 -6.3619 3.6373
quadrupole: -3.5936 11.3291 -7.7356 7.8510 -6.3619 3.6373
hfenergy: -669.443332 hartree
pointgroup: C01 [X(C12H13N1O2)]
dipole: 0.7673688 -0.4510603 0.2147181 debye
polarizability: 174.5451519|11.0844623|169.9509424|-9.7625765|-1.3939858|84.3331433 unknown
InChI: InChI=1S/C12H13NO2/c1-7-3-8(2)12-10(4-7)9(6-13-12)5-11(14)15/h3-4,6,13-14H,5H2,1-2H3
charge 0 multiplicity 1
28 atoms
O  -3.024048 1.720078 -0.375517
O  -3.902587 -0.303314 -1.102679
N  0.478948 -2.307509 0.151995
C  0.043892 -0.072221 0.354824
C  1.067933 -1.036702 0.06994
C  -1.179924 -0.811528 0.618226
C  2.406343 -0.674369 -0.226951
C  0.369908 1.311517 0.335964
C  -0.875053 -2.16636 0.481439
C  1.691468 1.704851 0.046734
C  -2.53407 -0.233532 0.968229
C  2.683933 0.707499 -0.228196
C  3.464398 -1.720889 -0.522373
C  2.082103 3.174214 0.017634
C  -3.233705 0.334117 -0.262152
H  -0.402914 2.063372 0.530151
H  0.959748 -3.191551 0.004571
H  -1.525045 -3.032768 0.589277
H  -2.433232 0.567488 1.720626
H  -3.187967 -1.022352 1.377241
H  3.707635 1.03524 -0.453271
H  3.607915 -2.412238 0.331929
H  3.197933 -2.336041 -1.404895
H  4.439172 -1.249311 -0.731507
H  2.86383 3.400363 0.76807
H  2.486889 3.46625 -0.970263
H  1.216048 3.82438 0.230512
H  -3.447953 2.046517 -1.215758
