program: Gaussian 09
title: 000053092
version: EM64L-G09RevD.01
frameworkgroup: C1[X(C22H29ClN4)]
method: RPBEPBE
basis: SDD
operation: Freq
keyword: #p
keyword: freq=noraman
keyword: PBEPBE/SDD
title: #p freq=noraman PBEPBE/SDD
converged: YES YES NO NO
title: Mulliken charges:
elementType: Cl N N N N C C C C C C C C C C C C C C C C C C C C C C H H H H H H H H H H H H H H H H H H H H H H H H H H H H H
charge: -0.083948 -0.079299 -0.255103 -0.088218 -0.092327 -0.350467 -0.350836 0.308524 0.137210 0.207281 -0.394658 -0.355418 -0.357778 -0.370712 0.342058 -0.328636 -0.223262 -0.141041 -0.617820 -0.615904 -0.618044 -0.616500 -0.413609 -0.401928 -0.243741 -0.234364 -0.249333 0.209106 0.220256 0.230993 0.196327 0.278234 0.190004 0.236675 0.213693 0.216415 0.264318 0.268920 0.250196 0.221338 0.189966 0.224479 0.220880 0.190985 0.231805 0.192645 0.227147 0.221656 0.219351 0.195246 0.224101 0.243434 0.231605 0.226033 0.223571 0.228497
chargesum: 0.00000
title: Mulliken charges with hydrogens summed into heavy atoms:
elementType: Cl N N N N C C C C C C C C C C C C C C C C C C C C C C
charge: -0.083948 -0.079299 -0.255103 -0.088218 -0.092327 0.078895 0.076484 0.308524 0.137210 0.207281 -0.116424 0.071261 0.072329 -0.106394 0.342058 -0.059716 0.026935 -0.141041 0.017962 0.027765 0.023404 0.022197 -0.170175 -0.170323 -0.017708 -0.010793 -0.020836
polarizability: 3.31643197e+02 1.31805649e+00 2.11431478e+02 -1.22456136e+01 -1.39490170e-01 3.15531376e+02
1716.lowfreq: -20.7432 -3.7856 -0.0005 -0.0004 -0.0001 3.9068 4.8982 15.5333 21.1647
frequency: -20.0727 15.2810 21.1311 23.9327 29.0194 46.7092 48.6889 67.9065 77.0102 86.7481 98.2719 103.0332 119.9859 151.5847 164.4712 191.1736 203.1511 207.7029 211.5570 214.9117 219.4017 238.9356 250.9847 267.4876 282.7338 301.2544 307.8613 333.1979 345.0893 361.7192 374.8123 406.6128 408.3500 419.3769 428.3653 432.5857 441.0770 467.0657 499.8108 553.1207 577.2544 584.1679 604.5716 616.1016 617.4150 647.0788 651.0385 703.7590 744.6400 755.0622 766.1812 784.5367 792.5018 800.2071 807.6690 808.6638 817.3436 828.0747 851.5783 875.7306 917.8425 922.3004 943.3000 959.3076 974.7112 988.7174 992.5451 1001.8881 1026.9142 1031.7970 1032.8469 1033.7653 1035.8847 1050.3329 1058.7587 1069.3961 1080.6468 1083.9071 1086.8832 1090.2342 1098.0506 1114.4540 1128.3884 1138.4589 1141.3982 1146.7996 1172.1954 1175.9788 1190.1775 1192.0379 1200.5922 1243.2004 1246.3065 1256.9361 1264.1044 1267.4503 1287.9293 1290.7984 1298.7844 1307.2556 1313.2082 1327.3291 1339.4016 1361.3128 1373.6060 1377.1914 1397.5736 1402.3818 1420.4032 1421.0716 1429.1155 1441.9115 1444.1438 1446.1708 1454.0351 1459.1940 1461.7365 1462.8353 1466.0290 1467.9301 1474.1654 1476.1504 1476.4892 1479.1493 1479.7863 1483.2517 1485.3589 1487.1806 1550.4114 1565.1393 1583.6994 1615.8222 1621.6991 2850.8068 2856.0828 2856.8385 2865.2889 2873.3190 2886.6885 2917.2744 2932.5661 3020.8889 3021.9391 3026.8437 3027.4066 3035.0234 3041.1023 3056.9750 3068.9665 3079.1008 3080.2645 3083.8241 3084.0737 3119.8031 3127.1761 3140.1706 3150.3963 3157.8750 3164.9365 3175.3151 3178.3068 3222.6827
redmass: 2.4909 4.8623 5.4822 3.8774 2.5992 4.1015 4.1931 4.5850 3.8443 3.7108 3.2611 2.6718 3.8977 2.3864 2.9262 4.1872 2.0066 1.5023 1.7225 2.2775 1.3520 1.1856 1.8770 4.4478 4.9939 4.8414 3.7748 4.2924 2.6651 2.9315 3.5951 2.8612 2.7062 3.3128 3.3838 2.9712 2.4813 3.2524 3.6958 3.8813 4.2698 6.1122 4.4354 5.8128 4.4207 3.5112 6.9711 1.8039 3.8860 5.2953 1.7400 4.7608 1.3749 1.5861 1.4664 1.6531 2.2673 3.6987 1.2588 1.4245 1.7880 3.1369 1.3125 5.3908 1.4549 5.0472 1.3096 3.1673 2.3145 2.1003 1.7452 1.5315 1.8343 1.9530 2.2649 2.5504 1.6269 1.7628 1.5524 1.3916 2.0392 1.7614 1.9494 1.6226 1.5952 1.7955 1.0869 2.0323 2.1059 1.1200 2.0635 1.5359 1.5918 1.6547 2.3530 2.4548 2.8302 1.5134 1.5859 1.2958 1.3696 1.6182 1.5338 2.5679 6.5347 1.3803 1.6188 3.7033 1.1416 1.1498 3.0137 1.1585 1.1608 3.4612 4.1285 1.0644 1.0562 1.0633 1.0720 1.0591 1.0526 1.0821 1.0636 2.5270 1.0817 1.0757 1.0560 1.0682 5.9364 7.2779 6.3589 6.1828 8.4334 1.0573 1.0564 1.0639 1.0581 1.0623 1.0680 1.0691 1.0678 1.0734 1.0732 1.0735 1.0730 1.0863 1.0876 1.0940 1.0931 1.1008 1.1007 1.1006 1.1006 1.0852 1.0869 1.0927 1.0955 1.0880 1.1013 1.0935 1.0964 1.0971
irintensity: 0.5334 0.0385 0.1772 0.0421 0.5724 0.4509 0.2532 0.5465 0.3451 0.1385 0.5025 0.6182 0.8224 1.1203 1.0215 0.5421 0.3201 1.2225 0.2079 0.2174 0.3162 1.7570 1.1287 0.4308 1.2689 0.6520 6.8832 0.6072 10.2982 3.1699 2.2677 0.5223 2.1197 9.1740 9.2673 1.8548 1.5620 6.3596 11.4240 9.2594 2.7489 2.0676 0.6026 5.7686 11.2350 6.1431 22.6356 44.5744 3.3951 16.2107 67.6615 49.9735 3.3044 22.4768 29.3596 16.4450 4.1285 18.8250 0.5371 15.2557 1.7048 15.7983 1.4584 11.8700 0.9243 0.2769 0.1547 0.3779 7.4144 59.0042 27.1425 11.6453 41.0286 25.7611 21.9209 27.2992 9.8287 1.1002 9.4943 9.9741 22.7036 12.4722 3.1781 7.5342 0.2729 5.0482 3.0227 62.4061 8.2253 1.4348 9.9177 4.1869 10.1992 13.3866 4.7321 9.6816 31.9421 2.1849 1.9865 7.6328 2.1931 1.5567 5.2830 5.0060 0.2316 0.7354 7.2791 36.3116 3.6205 3.4923 4.8985 3.7921 1.8792 1.7383 78.3374 7.4334 1.3064 20.6882 9.5971 4.7392 31.1674 12.5419 18.1470 10.4550 4.2068 7.4028 15.0258 21.2496 29.8070 9.0903 5.9654 42.1342 13.1626 77.3501 62.0806 73.3965 112.4267 156.3668 124.5478 29.7696 72.6913 45.2721 33.5592 39.7465 55.7445 2.7533 10.3391 22.3595 51.9844 27.7595 34.0101 73.3796 43.8793 7.9045 0.3262 23.6349 37.8315 0.9008 21.9118 3.7815 3.0038 0.5683
temp: 298.150 k
press: 1.00000 atm
elementType: 17 7 7 7 7 6 6 6 6 6 6 6 6 6 6 6 6 6 6 6 6 6 6 6 6 6 6 1 1 1 1 1 1 1 1 1 1 1 1 1 1 1 1 1 1 1 1 1 1 1 1 1 1 1 1 1
symmnumber: 1
zpe: 1224651.7 jmol-1
zpe.correction: 0.466445 hartree
zpe.thermalcorrener: 0.493486 hartree
zpe.thermalcorrenthalpy: 0.494430 hartree
zpe.thermalcorrgfe: 0.406243 hartree
zpe.sumelectzpe: -1532.723136 hartree
zpe.sumelectthermal: -1532.696096 hartree
zpe.sumelectthermalent: -1532.695151 hartree
zpe.sumelectthermalfe: -1532.783338 hartree
dipole: -3.4656 0.7407 -2.2819
dipole: 4.2149
quadrupole: -162.4911 -163.2343 -172.8510
quadrupole: 6.6566 -11.0645 3.4322
quadrupole: 3.7010 2.9578 -6.6588 6.6566 -11.0645 3.4322
hfenergy: -1533.1895816 hartree
pointgroup: C01 [X(C22H29Cl1N4)]
dipole: 1.1874761 -0.5525076 -1.0171194 debye
polarizability: 333.6702153|-10.1055587|213.8799363|10.8679773|11.7743391|311.0558994 unknown
InChI: InChI=1S/C22H29ClN4/c1-24(2)12-14-26(15-13-25(3)4)27-17-21(18-8-6-5-7-9-18)20-16-19(23)10-11-22(20)27/h5-11,16-17H,12-15H2,1-4H3
charge 0 multiplicity 1
56 atoms
Cl -2.228516 1.710831 4.699491
N  2.172506 -0.482741 -0.299618
N  0.792787 -0.16803 -0.099825
N  3.398696 2.852698 -1.704894
N  2.154701 -4.277603 0.154081
C  2.822224 0.461506 -1.259977
C  2.372039 -1.924673 -0.642482
C  0.264283 0.237982 1.13266
C  -1.149347 0.438545 0.946765
C  -1.456796 0.134043 -0.448278
C  -0.242059 -0.22444 -1.047393
C  2.804083 1.909183 -0.730993
C  1.950465 -2.85278 0.513646
C  0.915941 0.453677 2.364011
C  -2.766794 0.181398 -1.128201
C  -1.921442 0.902933 2.047517
C  0.133591 0.893631 3.449292
C  -1.258104 1.113659 3.26371
C  4.870625 2.754001 -1.789881
C  2.959183 4.245839 -1.476958
C  2.389729 -5.132704 1.336977
C  1.073738 -4.817984 -0.698415
C  -3.969145 -0.149409 -0.440735
C  -2.861765 0.545662 -2.501936
C  -5.215821 -0.116105 -1.101238
C  -4.106574 0.569736 -3.164565
C  -5.293407 0.243126 -2.466755
H  2.34669 0.445516 -2.266884
H  3.861256 0.104928 -1.374999
H  3.451053 -2.066167 -0.825326
H  1.838297 -2.20229 -1.580572
H  -0.052841 -0.55004 -2.068572
H  3.315146 1.939464 0.264724
H  1.753513 2.20979 -0.564867
H  0.892666 -2.643976 0.808001
H  2.581441 -2.615115 1.389274
H  1.991723 0.286654 2.464368
H  -2.989547 1.112172 1.952658
H  0.586857 1.074341 4.427962
H  5.176988 1.735238 -2.083806
H  5.382083 3.005281 -0.825254
H  5.241303 3.448525 -2.564527
H  3.350648 4.893468 -2.282079
H  3.303191 4.667442 -0.498638
H  1.856658 4.298114 -1.503116
H  1.514368 -5.182827 2.032928
H  3.258548 -4.755425 1.904608
H  2.619301 -6.162154 1.007262
H  0.961468 -4.210733 -1.613082
H  0.081766 -4.844842 -0.179836
H  1.32785 -5.847204 -1.008744
H  -3.922239 -0.473772 0.604259
H  -1.953426 0.8369 -3.042908
H  -6.12663 -0.379642 -0.551547
H  -4.153904 0.857164 -4.221221
H  -6.261749 0.269609 -2.978475
