program: Gaussian 09
title: 000052891
version: EM64L-G09RevD.01
frameworkgroup: C1[X(C18H36N2O)]
method: RPBEPBE
basis: SDD
operation: Freq
keyword: #p
keyword: freq=noraman
keyword: PBEPBE/SDD
title: #p freq=noraman PBEPBE/SDD
converged: YES YES NO NO
title: Mulliken charges:
elementType: O N N C C C C C C C C C C C C C C C C C C H H H H H H H H H H H H H H H H H H H H H H H H H H H H H H H H H H H H
charge: -0.444415 -0.215473 -0.156818 0.208142 0.292082 -0.455150 0.222812 -0.465505 -0.378758 -0.738728 -0.732987 -0.736978 -0.709976 -0.387087 -0.398378 -0.379497 -0.384923 -0.372948 -0.353004 -0.357019 -0.697277 0.232694 0.212404 0.190442 0.239752 0.222670 0.187628 0.218122 0.196551 0.229117 0.194452 0.234889 0.230760 0.231906 0.206078 0.261258 0.219654 0.209300 0.227801 0.177060 0.223322 0.247429 0.168766 0.198340 0.180469 0.186463 0.196016 0.186593 0.190720 0.345834 0.185750 0.188264 0.195171 0.193798 0.208810 0.213783 0.209819
chargesum: 0.00000
title: Mulliken charges with hydrogens summed into heavy atoms:
elementType: O N N C C C C C C C C C C C C C C C C C C
charge: -0.098580 -0.215473 -0.156818 0.208142 0.292082 -0.010051 0.222812 -0.035311 0.031540 -0.094939 -0.072886 -0.037737 -0.053221 0.013296 0.017816 -0.000688 -0.002443 0.004364 0.021010 0.031950 -0.064865
polarizability: 2.47845151e+02 9.88696238e+00 2.10410433e+02 -5.23623256e+00 -1.07857913e+00 1.84153512e+02
1716.lowfreq: -43.7878 -11.5638 -7.2437 -3.9036 -0.0015 -0.0004 0.0007 9.1255 11.5838
frequency: -40.9108 -4.0945 11.0039 30.8226 41.9613 45.4789 63.7253 66.2056 77.1712 91.5708 103.1914 123.2960 137.6705 143.9695 165.6944 178.4237 188.8245 195.2244 204.6453 213.5318 219.6695 227.6681 239.0816 256.0464 279.7522 289.9191 299.6186 314.3210 327.9914 345.7519 367.7542 384.1098 402.5035 418.7846 437.9196 451.5702 484.1527 524.3012 533.0287 569.5500 594.4869 602.7449 694.2567 716.2334 723.4790 743.2065 780.9058 812.5083 825.3133 845.3248 881.0050 882.8505 885.6851 889.5052 917.3627 924.9278 929.4029 950.1558 960.2716 969.5286 979.3417 995.8461 1000.6339 1007.8516 1011.1526 1016.6780 1028.4925 1049.1485 1058.2074 1076.7088 1079.3713 1083.7181 1093.3273 1115.9301 1118.9066 1147.5692 1160.8988 1171.8362 1179.7400 1185.0657 1188.4657 1197.9785 1203.4186 1220.6273 1233.1403 1247.4915 1252.6553 1262.8330 1265.7164 1274.8937 1276.2790 1280.9336 1285.8353 1287.2167 1291.7364 1298.3442 1328.8724 1334.9165 1348.2424 1350.0637 1355.8985 1367.0247 1371.1029 1378.8621 1384.6162 1384.6348 1394.2087 1413.2517 1447.7913 1450.5787 1450.9046 1457.3536 1458.4969 1462.2697 1463.2045 1464.1757 1465.3070 1467.9035 1468.5732 1475.1308 1475.5081 1478.2572 1480.8588 1481.6224 1486.2525 1486.4711 1490.3238 1497.2085 1565.5849 2922.4598 2944.3317 2945.7268 2947.8162 2950.0765 2952.5034 2957.0344 2958.9155 2965.6799 2970.0197 2972.2813 2972.6828 2976.4779 2978.0546 2981.3677 2988.7504 2992.0532 3001.3591 3014.5022 3018.3718 3027.9605 3032.9892 3039.1800 3040.3380 3059.0644 3066.9275 3068.4955 3068.7929 3072.2090 3073.7919 3082.9141 3085.2665 3085.4568 3090.7031 3109.8638 3571.2248
redmass: 1.5638 3.5854 3.7999 3.8194 3.4170 3.7480 3.1181 1.9867 3.0783 3.0988 3.1129 1.7477 2.3913 3.0486 3.0815 2.1310 1.6560 1.1152 2.1087 1.2634 1.5270 1.1082 1.9994 1.2869 1.2531 2.3467 2.5306 2.3384 2.2598 2.7087 3.4375 2.4921 2.5946 2.5894 2.7694 3.1174 2.8478 3.5682 2.6172 3.7462 2.8239 4.7918 2.6041 1.0632 1.1089 1.2258 1.3229 4.2423 2.1576 1.4872 2.1387 1.9864 1.9179 1.8709 1.5124 1.6449 1.4026 1.4305 1.6409 1.7169 2.1078 4.1527 2.8451 1.4674 1.4353 1.4792 2.9952 3.0787 2.6321 2.3638 2.1670 1.8446 2.2563 1.8519 2.4773 1.4623 1.8043 1.6670 2.1182 1.8527 2.0985 1.3300 1.9798 1.4415 1.3459 2.0193 1.5694 1.5955 1.2952 1.1676 1.5853 1.5915 1.2358 1.2834 1.1677 1.2839 1.4055 1.5102 1.5577 1.7268 1.6045 1.2225 1.2101 1.4467 1.2183 1.2474 1.8035 1.3504 1.1013 1.0829 1.0518 1.0720 1.0697 1.0691 1.0561 1.0526 1.0672 1.0796 1.0612 1.0741 1.0519 1.0568 1.0593 1.0887 1.0696 1.0852 1.0813 1.0727 7.3830 1.0693 1.0601 1.0627 1.0599 1.0607 1.0639 1.0600 1.0607 1.0588 1.0364 1.0615 1.0371 1.0360 1.0359 1.0955 1.0978 1.0365 1.1009 1.0984 1.1024 1.0957 1.0995 1.0981 1.0937 1.1008 1.1005 1.0993 1.0995 1.0991 1.0989 1.0995 1.0991 1.0990 1.0993 1.1010 1.0666
irintensity: 0.0407 0.6995 0.2079 0.6943 0.2332 2.9387 0.5442 0.3935 1.8105 1.0916 2.0237 0.0426 0.3479 0.9620 12.1529 0.3758 3.2301 16.3647 32.9028 43.9434 50.1181 0.0008 0.5924 0.4045 0.4042 0.3389 1.2009 0.8237 6.0940 2.2107 0.4879 3.3252 1.9932 4.0080 1.6442 1.3156 0.8802 13.7308 4.2472 6.7909 1.3450 10.8124 1.7020 14.3163 0.3069 5.3117 0.3501 2.0451 6.1957 3.7713 10.5321 5.4790 5.1855 4.2283 1.0842 0.6021 1.5501 2.6235 26.9901 7.2850 11.3126 1.0270 34.3512 2.7633 1.2033 6.2582 1.3116 2.9673 6.1530 1.0909 0.4124 7.2945 6.5732 13.6041 22.2157 2.8722 27.2192 41.0248 52.1117 6.8698 16.5082 4.8533 22.4758 1.4867 2.0195 35.7634 9.3183 12.7153 0.8287 33.3465 56.6423 8.4664 21.9132 20.0652 9.0429 7.7702 0.5721 13.1985 0.5788 1.0413 5.6664 21.3428 26.7734 23.8052 14.0278 10.2428 90.9061 1.8399 18.2964 10.7529 4.1696 0.4116 1.3271 0.0576 1.5050 2.9108 11.0819 1.6685 4.7498 3.7104 9.7158 25.3700 8.1017 6.1536 4.9277 23.7760 12.2644 6.1867 123.9018 58.3923 4.0303 9.4651 2.4321 3.2584 61.5733 38.5492 69.6224 130.4516 39.6661 60.1935 36.7501 38.5411 23.0725 4.8353 3.5473 31.5006 3.6127 15.1063 4.5069 38.9462 65.2451 61.1400 27.0580 75.3741 93.9237 12.5709 63.0437 24.3389 60.7865 32.9368 34.6254 48.6010 37.3821 15.4488 3.9560
temp: 298.150 k
press: 1.00000 atm
elementType: 8 7 7 6 6 6 6 6 6 6 6 6 6 6 6 6 6 6 6 6 6 1 1 1 1 1 1 1 1 1 1 1 1 1 1 1 1 1 1 1 1 1 1 1 1 1 1 1 1 1 1 1 1 1 1 1 1
symmnumber: 1
zpe: 1339722.8 jmol-1
zpe.correction: 0.510273 hartree
zpe.thermalcorrener: 0.535574 hartree
zpe.thermalcorrenthalpy: 0.536518 hartree
zpe.thermalcorrgfe: 0.453805 hartree
zpe.sumelectzpe: -890.486170 hartree
zpe.sumelectthermal: -890.460870 hartree
zpe.sumelectthermalent: -890.459926 hartree
zpe.sumelectthermalfe: -890.542639 hartree
dipole: -2.8821 -2.8615 1.6323
dipole: 4.3771
quadrupole: -126.4769 -122.9200 -133.5148
quadrupole: 8.9381 -4.7979 3.5395
quadrupole: 1.1603 4.7172 -5.8775 8.9381 -4.7979 3.5395
hfenergy: -890.9964436 hartree
pointgroup: C01[X(C18H36N2O1)]
dipole: 1.0984175 1.2423643 0.4643274 debye
polarizability: 247.1706572|11.3952209|210.2495679|5.6826083|-3.2839743|184.9888709 unknown
InChI: InChI=1S/C18H36N2O/c1-6-7-8-9-10-11-12-13-16-19-17(2,3)14-20(16)18(4,5)15-21/h21H,6-15H2,1-5H3
charge 0 multiplicity 1
57 atoms
O  4.590813 1.558607 -1.389458
N  2.974709 -0.015549 0.416878
N  1.150213 -1.242318 -0.311443
C  2.069071 -2.232248 0.361972
C  3.764442 1.1613 0.890208
C  3.171974 -1.351412 1.048264
C  1.729483 -0.054776 -0.256571
C  1.118125 1.150048 -0.951144
C  3.991384 2.219004 -0.224015
C  1.274782 -3.076903 1.377291
C  2.684117 -3.129977 -0.740142
C  5.169164 0.681562 1.345608
C  3.042519 1.859723 2.081853
C  -0.284714 0.887431 -1.545354
C  -1.403149 0.758266 -0.487653
C  -2.802245 0.580928 -1.118336
C  -3.929073 0.431495 -0.071423
C  -5.332173 0.266731 -0.698229
C  -6.456872 0.106237 0.349596
C  -7.862235 -0.046406 -0.27633
C  -8.977902 -0.210332 0.778882
H  4.184948 -1.743927 0.855154
H  3.020545 -1.299394 2.149342
H  1.055028 2.005522 -0.248053
H  1.812246 1.452039 -1.761181
H  3.045243 2.722122 -0.496037
H  4.677282 2.986514 0.195942
H  0.799149 -2.429781 2.136168
H  1.934333 -3.801027 1.892663
H  0.476319 -3.636641 0.859112
H  3.331319 -3.912001 -0.298463
H  3.287144 -2.522456 -1.438855
H  1.879437 -3.619054 -1.316586
H  5.110156 -0.02915 2.18676
H  5.756253 1.553905 1.686486
H  5.70364 0.210408 0.504301
H  2.042782 2.226576 1.787835
H  3.63019 2.716744 2.461673
H  2.908885 1.144481 2.913133
H  -0.53053 1.723041 -2.23378
H  -0.248358 -0.040157 -2.145694
H  -1.172877 -0.109205 0.158418
H  -1.408198 1.661063 0.161374
H  -2.79253 -0.314046 -1.774849
H  -3.026454 1.44795 -1.776074
H  -3.928909 1.318432 0.597037
H  -3.710058 -0.443842 0.574935
H  -5.552546 1.145958 -1.339837
H  -5.330555 -0.615784 -1.371947
H  4.835641 2.242465 -2.061998
H  -6.453549 0.984359 1.02933
H  -6.241869 -0.7783 0.985276
H  -7.863698 -0.921667 -0.957874
H  -8.076762 0.839407 -0.908821
H  -9.013191 0.664554 1.455518
H  -9.972699 -0.313736 0.307184
H  -8.803687 -1.107981 1.401954
