program: Gaussian 09
title: 000052890
version: EM64L-G09RevD.01
frameworkgroup: C1[X(C16H32N2O)]
method: RPBEPBE
basis: SDD
operation: Freq
keyword: #p
keyword: freq=noraman
keyword: PBEPBE/SDD
title: #p freq=noraman PBEPBE/SDD
converged: YES YES NO NO
title: Mulliken charges:
elementType: O N N C C C C C C C C C C C C C C C C H H H H H H H H H H H H H H H H H H H H H H H H H H H H H H H H
charge: -0.448493 -0.185591 -0.128831 0.220027 -0.452985 0.177046 -0.487225 -0.385373 -0.725465 -0.732227 -0.389738 -0.360828 -0.387884 -0.380104 -0.373447 -0.319891 -0.352956 -0.356815 -0.696601 0.213605 0.227788 0.201282 0.238639 0.196987 0.224437 0.225511 0.196572 0.233898 0.196842 0.218342 0.232498 0.234414 0.237816 0.195978 0.189571 0.197180 0.193728 0.191810 0.192882 0.190752 0.189458 0.198891 0.201163 0.187917 0.187335 0.195300 0.194608 0.348030 0.209702 0.214968 0.209474
chargesum: 0.00000
title: Mulliken charges with hydrogens summed into heavy atoms:
elementType: O N N C C C C C C C C C C C C C C C C
charge: -0.100463 -0.185591 -0.128831 0.220027 -0.011591 0.177046 -0.047304 0.036051 -0.069483 -0.084545 0.082493 0.024721 0.003025 0.004589 0.006762 0.080163 0.022296 0.033094 -0.062457
polarizability: 2.33792700e+02 -1.20939264e+01 1.89140662e+02 1.98567688e+00 8.42140601e-01 1.57037362e+02
1716.lowfreq: -8.8649 -5.1731 -0.0008 -0.0004 0.0007 4.3728 13.2803 26.4637 33.9605
frequency: 13.2524 26.3732 33.8141 38.1741 38.8472 56.3210 63.1018 73.6973 83.1299 90.8344 96.7681 115.6358 136.0186 140.5253 148.5063 156.1524 203.3779 222.3127 228.7198 245.7108 260.3522 276.5754 280.9195 289.3460 293.2221 320.8144 339.3585 363.9750 393.7350 439.8841 467.1857 473.3581 494.3356 586.5931 634.9305 706.4076 719.3817 722.4668 731.9637 755.3505 778.9697 792.6222 806.3325 818.5995 851.2538 885.8860 888.0280 919.0749 943.4976 948.4162 968.6161 973.1634 986.7716 989.1517 993.0342 1007.2446 1012.7509 1013.1875 1036.9600 1051.4300 1068.6491 1079.8547 1081.1815 1087.9834 1120.1945 1128.5600 1147.6645 1172.5867 1181.6754 1192.9887 1204.1217 1206.7161 1210.4163 1217.4513 1243.0150 1245.3728 1248.3518 1254.6166 1270.7850 1278.3333 1279.8617 1284.0116 1292.7625 1294.0875 1296.1026 1299.4248 1314.3189 1334.6993 1337.2767 1347.5737 1354.3130 1355.2209 1368.7058 1384.2864 1389.0686 1406.8404 1417.6378 1450.8147 1453.7167 1460.1306 1460.6557 1463.8864 1465.5301 1467.3466 1468.5652 1470.6624 1474.4717 1476.5468 1480.4642 1482.0021 1484.3992 1485.8632 1489.0999 1496.5700 1578.7932 2938.4748 2945.7534 2948.9587 2949.5706 2950.9124 2954.8918 2961.2577 2967.8830 2971.1022 2971.1921 2973.9434 2977.9589 2982.1342 2985.1283 2988.0676 2995.5243 2996.3398 3008.4817 3008.5958 3009.6192 3023.1016 3034.3122 3042.0920 3067.3302 3069.5471 3070.1499 3070.3013 3074.2422 3074.9338 3087.1144 3092.7069 3576.1948
redmass: 4.0711 3.4446 1.6618 3.8190 3.1853 3.7589 3.5768 1.7647 3.5015 2.8686 2.0854 1.7852 2.4219 2.9324 1.9544 3.8161 1.0656 3.1942 1.1211 1.1708 1.1200 2.8355 2.2491 2.8878 2.6063 2.8215 2.4790 2.9925 4.0808 3.1819 2.3713 3.0048 3.4631 3.8859 4.8064 5.7838 1.0611 1.0851 1.1427 1.3691 2.2263 3.3750 1.1879 1.5211 2.0509 1.4176 1.8479 1.6769 1.3172 1.2752 1.7451 3.4434 3.8447 4.4303 3.8961 2.0196 1.5647 1.2597 3.2232 3.1056 2.6775 2.1382 2.2838 1.4951 2.6503 1.7550 1.3295 1.8358 1.9282 1.9004 1.2663 1.2933 1.6856 1.5203 1.5589 1.8490 1.4404 2.3614 1.2651 1.2268 1.1098 1.1098 1.1704 1.1875 1.2714 1.4151 1.4571 1.4559 1.2870 1.5477 1.6862 1.6221 1.2210 1.2461 1.2175 1.4310 2.2133 1.0510 1.1309 1.0727 1.0763 1.0663 1.0503 1.0781 1.0619 1.0756 1.0812 1.0425 1.0855 1.0662 1.0809 1.0907 1.0936 1.1317 8.8503 1.0621 1.0557 1.0586 1.0585 1.0590 1.0593 1.0590 1.0585 1.0415 1.0565 1.0353 1.0362 1.0956 1.0691 1.0945 1.1057 1.0995 1.0623 1.0989 1.1021 1.1031 1.1029 1.1033 1.1007 1.0996 1.0994 1.1020 1.1009 1.0992 1.1000 1.0992 1.0668
irintensity: 0.1354 0.1317 0.0463 0.3950 0.1456 1.2898 0.7410 0.2005 2.4842 1.4456 11.6500 0.3030 0.1374 0.5722 0.0883 0.6866 0.1504 0.0558 0.0006 1.2582 142.3703 12.4284 11.8301 2.0844 3.4219 1.2504 4.8270 0.8556 2.3418 0.7584 2.7919 0.1926 7.2275 3.2993 13.8662 8.6018 15.2720 0.4127 2.1139 1.3234 4.8121 2.6627 3.5182 1.4890 14.1164 0.9054 5.0923 0.3567 1.4020 0.7587 3.1507 98.2956 4.5500 0.2319 6.1607 5.5901 2.4571 4.2402 1.5212 1.9918 0.8874 0.1018 0.6065 9.8697 16.1875 5.3055 2.3610 10.7414 6.8879 23.1436 32.2661 17.8669 2.4083 2.4573 6.4039 10.1388 6.0111 12.7105 16.3018 3.3043 0.1093 1.1408 11.5381 0.9387 2.0484 42.2910 13.5661 3.5832 0.5440 0.9284 0.1976 0.5150 23.2674 11.9073 11.1892 5.0439 64.8066 2.7468 22.8506 0.0246 1.1960 0.0537 3.8485 2.6821 3.3895 1.6550 2.2542 12.1943 1.9747 28.4219 6.2538 4.9959 33.5028 10.5908 172.6984 51.3772 54.4602 0.8148 0.0144 3.8018 0.0688 50.9913 117.9306 55.4603 37.4051 30.1650 45.0345 0.6330 34.2296 7.2047 53.0052 3.0238 48.3323 30.0418 2.4253 0.7355 16.7340 170.5960 94.9191 14.6505 59.0533 50.2555 36.2759 56.9146 11.0115 43.4326 3.1540
temp: 298.150 k
press: 1.00000 atm
elementType: 8 7 7 6 6 6 6 6 6 6 6 6 6 6 6 6 6 6 6 1 1 1 1 1 1 1 1 1 1 1 1 1 1 1 1 1 1 1 1 1 1 1 1 1 1 1 1 1 1 1 1
symmnumber: 1
zpe: 1197464.7 jmol-1
zpe.correction: 0.456090 hartree
zpe.thermalcorrener: 0.480500 hartree
zpe.thermalcorrenthalpy: 0.481444 hartree
zpe.thermalcorrgfe: 0.398092 hartree
zpe.sumelectzpe: -812.044665 hartree
zpe.sumelectthermal: -812.020256 hartree
zpe.sumelectthermalent: -812.019312 hartree
zpe.sumelectthermalfe: -812.102664 hartree
dipole: 0.9833 2.3683 0.0384
dipole: 2.5645
quadrupole: -110.8860 -120.8011 -121.8375
quadrupole: 11.4507 1.4664 -8.8063
quadrupole: 6.9556 -2.9596 -3.9960 11.4507 1.4664 -8.8063
hfenergy: -812.5007557 hartree
pointgroup: C01 [X(C16H32N2O1)]
dipole: 0.4046171 -0.9242298 -0.010391 debye
polarizability: 233.3176114|12.9292998|189.626589|-1.9850743|0.6652899|157.0265235 unknown
InChI: InChI=1S/C16H32N2O/c1-4-5-6-7-8-9-10-11-15-17-16(2,3)14-18(15)12-13-19/h19H,4-14H2,1-3H3
charge 0 multiplicity 1
51 atoms
O  2.965913 -4.109399 -0.214253
N  3.064805 -0.382528 -0.466928
N  3.059508 1.585452 0.746086
C  4.304668 1.629473 -0.120338
C  4.376632 0.213634 -0.817699
C  2.436881 0.451184 0.480259
C  1.099167 0.089458 1.081887
C  -0.093672 0.379376 0.129357
C  4.1197 2.756105 -1.164681
C  5.533736 1.902497 0.77031
C  2.739672 -1.779499 -0.75114
C  -1.451646 0.006324 0.763393
C  -2.659778 0.339989 -0.140247
C  -4.013846 -0.076039 0.477595
C  -5.22946 0.285629 -0.405213
C  3.382498 -2.774526 0.239764
C  -6.579456 -0.159821 0.200731
C  -7.798005 0.21436 -0.6737
C  -9.140803 -0.246261 -0.066391
H  5.217441 -0.393824 -0.420248
H  4.497355 0.292814 -1.915101
H  1.077942 -0.977191 1.382346
H  0.984868 0.693137 1.998681
H  0.03523 -0.175567 -0.822147
H  -0.081271 1.455859 -0.130518
H  3.250758 2.543848 -1.813586
H  5.019992 2.857437 -1.800506
H  3.93621 3.716524 -0.652431
H  6.460869 1.943768 0.167091
H  5.644293 1.113046 1.53541
H  5.411287 2.866475 1.294537
H  3.079176 -2.035044 -1.771998
H  1.645413 -1.925313 -0.733013
H  -1.561358 0.538173 1.731616
H  -1.460673 -1.078432 1.001352
H  -2.670184 1.429967 -0.349591
H  -2.535298 -0.163585 -1.121938
H  -4.009292 -1.170682 0.663699
H  -4.127153 0.406612 1.471133
H  -5.246843 1.383045 -0.572776
H  -5.106714 -0.17889 -1.406315
H  4.488358 -2.672565 0.224473
H  3.021301 -2.566476 1.269593
H  -6.699148 0.294761 1.206788
H  -6.566462 -1.259053 0.357307
H  -7.815288 1.313491 -0.822361
H  -7.673545 -0.232858 -1.68127
H  3.349938 -4.801443 0.37962
H  -9.302925 0.210064 0.928659
H  -9.99538 0.033771 -0.709676
H  -9.160616 -1.345077 0.062977
