program: Gaussian 09
title: 000052873
version: EM64L-G09RevD.01
frameworkgroup: C1[X(C16H14O3)]
method: RPBEPBE
basis: SDD
operation: Freq
keyword: #pfreq=noraman
keyword: PBEPBE/SDD
title: #p freq=noraman PBEPBE/SDD
converged: YES YES NO NO
title: Mulliken charges:
elementType: O O O C C C C C C C C C C C C C C C C H H H H H H H H H H H H H H
charge: -0.245975 -0.413710 -0.244014 0.205592 0.345429 0.407246 -0.396981 -0.368870 -0.437870 -0.241157 -0.531414 -0.423673 -0.262551 -0.487378 -0.322252 0.183737 -0.257666 -0.243359 0.183844 0.228099 0.232994 0.242926 0.252789 0.239639 0.273155 0.240162 0.232580 0.290197 0.258566 0.217952 0.232834 0.232994 0.376134
chargesum: 0.00000
title: Mulliken charges with hydrogens summed into heavy atoms:
elementType: O O O C C C C C C C C C C C C C C C C
charge: -0.245975 -0.037577 -0.244014 0.205592 0.345429 0.407246 -0.168882 -0.135876 -0.194944 0.011632 -0.018620 -0.183511 -0.029971 0.061385 -0.104300 0.183737 -0.024831 -0.010365 0.183844
polarizability: 3.45188327e+02 2.55430355e+00 2.04051002e+02 -4.28404369e+00 3.08529449e-01 8.48362255e+01
1716.lowfreq: -7.7060 -6.5595 -0.0004 0.0005 0.0007 2.8598 9.5683 23.9472 34.4818
frequency: 9.0693 23.9239 34.4764 42.4478 62.9429 77.7784 123.6774 142.0722 161.1477 175.4787 182.0204 233.7959 277.3883 281.9536 363.2407 418.5806 432.5154 470.0801 481.2692 494.9032 510.5879 518.3013 538.6162 559.4858 586.6528 595.3306 643.4850 648.9081 673.7662 744.4301 744.8243 781.2294 783.9803 794.8611 815.7461 860.8115 870.3012 883.3437 890.8663 922.5899 937.2276 965.6069 985.7855 996.7758 1003.4698 1011.3545 1013.7714 1035.3901 1045.4256 1078.4889 1095.6927 1128.8706 1152.0642 1153.7992 1180.0248 1194.0374 1230.7782 1234.3062 1247.2077 1251.9551 1257.1448 1300.7211 1330.3279 1333.4563 1370.1003 1378.8882 1408.0339 1413.1546 1439.3468 1441.1935 1446.3349 1457.2797 1518.5827 1549.8563 1584.3016 1590.1659 1628.7268 1636.2778 1662.1248 2972.5814 2993.5699 3026.5900 3071.2695 3119.6458 3124.4876 3126.5973 3127.9852 3138.9534 3143.1522 3157.8885 3163.5453 3172.7179 3512.2706
redmass: 6.0968 6.1816 5.1072 5.6277 4.2392 3.4358 4.4726 2.4850 3.6814 3.7641 6.1549 5.5249 3.3276 7.5830 5.0172 2.9125 4.2527 3.1423 3.5417 4.8238 2.3466 3.3176 3.9777 3.0785 3.6984 5.8717 1.9812 1.9267 5.4591 1.6111 2.8143 1.8218 5.4491 1.6971 1.6049 4.6406 1.8047 2.9538 2.2516 1.4476 4.0871 1.3933 1.3511 1.3704 1.4383 4.5014 1.7429 2.4721 2.9056 2.1506 2.1862 1.7854 1.3353 1.3690 1.1041 1.2411 1.2828 1.9595 1.7108 1.3678 1.6466 1.6244 2.0494 1.4972 2.1996 2.4497 2.5258 6.2233 1.1006 2.4377 1.1017 2.3586 3.5884 7.4928 7.3566 4.9933 6.2328 5.4454 8.0144 1.0624 1.0659 1.0957 1.0940 1.0924 1.0872 1.0864 1.0868 1.0893 1.0904 1.0948 1.0986 1.0975 1.0639
irintensity: 0.6749 0.9128 1.7307 2.9824 0.0626 1.1978 4.7864 2.4682 0.2328 1.7887 1.3338 5.3696 3.4966 3.0278 0.5086 8.9940 42.5102 0.6664 11.0097 17.2916 40.2681 20.1705 26.5387 26.2660 26.9360 3.4319 50.5111 65.6986 6.4650 2.9535 0.3649 67.3514 0.1080 19.4193 55.5181 0.2102 14.4335 10.8427 2.0835 3.9351 6.2476 0.7145 3.2290 5.3178 45.3214 3.5661 36.8873 10.0281 144.1238 256.7143 30.4583 90.9643 10.3144 5.4266 1.1011 4.7010 72.9008 33.4709 17.6672 45.3136 27.4091 7.3448 129.9071 12.7530 168.2297 41.1227 0.8796 31.8767 2.0813 11.1786 67.1142 0.6170 9.5729 434.4562 4.0715 4.4132 23.6848 134.9206 193.2177 33.3989 47.1509 8.4737 8.0434 4.1724 0.6824 2.4230 7.8997 6.5225 13.9060 33.4422 29.6475 17.4276 25.0307
temp: 298.150 k
press: 1.00000 atm
elementType: 8 8 8 6 6 6 6 6 6 6 6 6 6 6 6 6 6 6 6 1 1 1 1 1 1 1 1 1 1 1 1 1 1
symmnumber: 1
zpe: 672278.5 jmol-1
zpe.correction: 0.256057 hartree
zpe.thermalcorrener: 0.273202 hartree
zpe.thermalcorrenthalpy: 0.274146 hartree
zpe.thermalcorrgfe: 0.206918 hartree
zpe.sumelectzpe: -842.444542 hartree
zpe.sumelectthermal: -842.427398 hartree
zpe.sumelectthermalent: -842.426454 hartree
zpe.sumelectthermalfe: -842.493682 hartree
dipole: -2.8447 1.8541 -1.0141
dipole: 3.5438
quadrupole: -89.2997 -105.1702 -117.5138
quadrupole: 0.1555 -5.0839 -4.0022
quadrupole: 14.6949 -1.1756 -13.5193 0.1555 -5.0839 -4.0022
hfenergy: -842.7005996 hartree
pointgroup: C01 [X(C16H14O3)]
dipole: -1.1661784 -0.7585511 0.0922998 debye
polarizability: 344.2133946|-13.1547064|186.3534579|2.7931172|43.316877|103.5087017 unknown
InChI: InChI=1S/C16H14O3/c17-14(10-11-16(18)19)9-8-13-6-3-5-12-4-1-2-7-15(12)13/h1-9,18H,10-11H2
charge 0 multiplicity 1
33 atoms
O  2.364853 1.432367 0.56413
O  7.263184 0.024018 0.464984
O  6.202541 -0.831871 -1.411878
C  -2.683646 0.435358 0.044759
C  -1.500319 -0.375764 -0.216835
C  -3.995584 -0.133696 -0.211913
C  -1.674224 -1.687555 -0.711493
C  -2.626839 1.77885 0.547325
C  -4.105292 -1.470572 -0.712579
C  -0.158547 0.162763 0.027264
C  3.60569 -0.56303 -0.121252
C  -5.172764 0.647833 0.038051
C  -2.960604 -2.234734 -0.958142
C  4.85876 0.127806 0.435379
C  1.048872 -0.466432 -0.150705
C  2.323349 0.232827 0.142992
C  -3.790433 2.516696 0.781479
C  -5.077791 1.950505 0.526013
C  6.120333 -0.292229 -0.2848
H  -0.794866 -2.306885 -0.915834
H  -1.662105 2.248849 0.756094
H  -5.102517 -1.885539 -0.900987
H  -0.073541 1.192101 0.398119
H  3.494268 -1.587024 0.285133
H  3.712828 -0.692796 -1.21887
H  -6.152623 0.198742 -0.162981
H  -3.049667 -3.256311 -1.342008
H  4.739576 1.225251 0.327753
H  4.984162 -0.045032 1.518044
H  1.124772 -1.498635 -0.514583
H  -3.715807 3.540156 1.164731
H  -5.980499 2.541244 0.714455
H  8.073579 -0.228362 -0.056145
