program: Gaussian 09
title: 000052884
version: EM64L-G09RevD.01
frameworkgroup: C1[X(C18H13FN2O2)]
method: RPBEPBE
basis: SDD
operation: Freq
keyword: #p
keyword: freq=noraman
keyword: PBEPBE/SDD
title: #p freq=noraman PBEPBE/SDD
converged: YES YES NO NO
title: Mulliken charges:
elementType: F O O N N C C C C C C C C C C C C C C C C C C H H H H H H H H H H H H H
charge: -0.202081 -0.321153 -0.314964 -0.330124 -0.344748 0.189940 0.399690 0.193325 -0.364905 -0.432014 -0.401364 -0.424864 -0.253499 0.160136 -0.247810 -0.240113 0.312499 0.208765 -0.489305 -0.353375 0.353623 -0.194467 -0.370079 0.292246 0.243709 0.248750 0.239155 0.236001 0.231371 0.231489 0.365190 0.356479 0.303408 0.217077 0.238955 0.263057
chargesum: 0.00000
title: Mulliken charges with hydrogens summed into heavy atoms:
elementType: F O O N N C C C C C C C C C C C C C C C C C C
charge: -0.202081 -0.321153 -0.314964 0.035066 0.011731 0.189940 0.399690 0.193325 -0.072659 -0.188304 -0.152614 -0.185709 -0.017498 0.160136 -0.016438 -0.008624 0.312499 0.208765 -0.185897 -0.136298 0.353623 0.044488 -0.107022
polarizability: 3.90241571e+02 6.40025610e+00 2.33749627e+02 -9.19360250e+00 1.67401619e+00 1.02450896e+02
1716.lowfreq: -7.9532 -5.0589 0.0002 0.0003 0.0007 0.8709 5.5881 24.4135 33.0063
frequency: -4.7845 24.3984 32.9899 38.9869 88.4334 104.7972 126.7885 147.8791 166.5649 181.4889 208.7458 219.6583 222.5317 296.9085 308.9212 358.0524 374.3528 385.8036 403.3213 437.8169 445.9978 472.1939 479.3357 507.1106 516.9783 526.6743 531.6574 572.0873 601.5378 615.9232 636.9266 651.5377 658.1771 678.7296 712.1203 720.9895 752.4338 753.4070 786.1748 790.7180 796.0157 797.6604 822.4165 868.1029 887.8724 890.9186 923.4972 931.1200 937.6915 970.6205 971.2821 987.4130 991.0010 996.9615 1000.5755 1031.4431 1070.3651 1082.4545 1085.7193 1119.9505 1151.9548 1162.1247 1177.2512 1183.5715 1192.5888 1220.8198 1237.8894 1247.2613 1268.3032 1280.8709 1303.7458 1366.9175 1392.7441 1398.9870 1405.5687 1414.1545 1436.3022 1442.4708 1454.5926 1475.6916 1516.3378 1519.1842 1532.0211 1564.9111 1586.1913 1595.3500 1601.1447 1618.2119 1631.0966 3124.3833 3127.5850 3134.8826 3138.2964 3139.1759 3159.3064 3160.4568 3163.3515 3177.9025 3181.8134 3183.2004 3489.3924 3507.3502
redmass: 6.1831 6.4030 7.5152 6.9905 5.1373 9.2540 5.7376 5.8525 7.1170 4.1723 7.5613 4.9642 5.0214 6.1027 8.8771 7.1731 5.5861 8.0652 3.7937 3.3503 4.2743 3.2868 6.3222 5.0187 6.4969 5.2786 5.5256 4.4064 1.4108 1.1315 3.2851 6.4623 6.5730 2.6327 2.9754 2.8558 1.5069 6.8501 5.1417 2.0891 1.6552 4.8799 1.6397 5.8097 1.6581 1.4336 1.4710 1.5062 3.7489 1.3461 1.3708 6.1784 1.3954 4.3213 1.3472 2.4334 2.2128 2.0054 1.7124 2.2288 1.6898 1.7943 1.1220 1.1626 1.4082 2.6959 1.8846 1.7675 1.6802 1.6599 1.8921 2.3783 9.2939 3.6795 2.3445 6.3598 3.0603 2.5236 2.5493 2.5735 4.0584 4.1942 3.4788 6.3977 7.2638 5.6373 6.3394 6.9010 6.5390 1.0867 1.0865 1.0916 1.0879 1.0907 1.0975 1.0929 1.0989 1.0928 1.0960 1.0980 1.0789 1.0794
irintensity: 0.6572 0.6451 1.7931 0.7017 1.2802 9.3379 0.0574 0.9824 1.7480 1.8098 17.1007 10.2888 1.1682 0.3935 1.0741 0.4274 25.7333 8.5712 3.6011 0.7101 10.5624 1.3928 13.6447 18.9707 1.9034 9.2035 2.5315 19.9375 27.2965 124.7252 1.1346 8.7731 0.3574 16.7955 43.8946 35.2968 2.0061 21.4178 3.8166 68.4946 61.7350 8.5801 57.9777 17.2372 3.5135 0.5935 26.5654 6.7229 27.1417 0.4717 2.1971 0.1255 3.0973 3.8223 0.5515 11.5310 10.3031 10.6489 3.0760 26.9431 5.3891 2.7619 6.2864 6.6767 0.2571 16.0543 17.6720 25.7702 11.1269 3.5465 6.3007 275.4126 4.6099 276.7202 359.3525 1.4292 174.2288 82.8629 88.4891 40.8316 101.5291 153.2996 176.5749 31.9714 14.6672 0.6105 10.2118 13.0564 2.4686 0.8367 0.4157 14.0400 10.1834 22.1689 31.7649 9.7913 20.9704 4.5065 15.0140 5.6255 22.9527 157.3702
temp: 298.150 k
press: 1.00000 atm
elementType: 9 8 8 7 7 6 6 6 6 6 6 6 6 6 6 6 6 6 6 6 6 6 6 1 1 1 1 1 1 1 1 1 1 1 1 1
symmnumber: 1
zpe: 704406.6 jmol-1
zpe.correction: 0.268294 hartree
zpe.thermalcorrener: 0.286145 hartree
zpe.thermalcorrenthalpy: 0.287090 hartree
zpe.thermalcorrgfe: 0.221096 hartree
zpe.sumelectzpe: -1051.942580 hartree
zpe.sumelectthermal: -1051.924729 hartree
zpe.sumelectthermalent: -1051.923785 hartree
zpe.sumelectthermalfe: -1051.989778 hartree
dipole: -2.2544 -1.3296 -0.6136
dipole: 2.6882
quadrupole: -117.5296 -123.7938 -138.2541
quadrupole: -20.8144 -11.1758 -4.1367
quadrupole: 8.9962 2.7320 -11.7283 -20.8144 -11.1758 -4.1367
hfenergy: -1052.2108743 hartree
pointgroup: C01 [X(C18H13F1N2O2)]
dipole: -0.8533866 -0.2238146 -0.5832954 debye
polarizability: 386.5328502|30.3153725|157.4106915|-0.5811731|64.6139412|182.4985522 unknown
InChI: InChI=1S/C18H13FN2O2/c19-14-8-3-7-13(11-14)17(22)20-21-18(23)16-10-4-6-12-5-1-2-9-15(12)16/h1-11,20-21H
charge 0 multiplicity 1
36 atoms
F  7.234056 0.633039 1.474166
O  -0.741338 -0.28567 -1.659151
O  2.176985 0.96575 1.891038
N  0.05385 0.480794 0.34947
N  1.346887 0.31547 -0.148186
C  -3.489628 -0.433966 -0.272818
C  -4.780478 -0.147713 0.327913
C  -2.366708 0.411385 0.079551
C  -3.388486 -1.549614 -1.171414
C  -4.919453 0.959033 1.227679
C  -2.55356 1.494404 0.957907
C  -5.905907 -0.9795 0.013063
C  -3.826922 1.770737 1.534099
C  -1.005164 0.169052 -0.491011
C  -4.504487 -2.341274 -1.454519
C  -5.774314 -2.058587 -0.860935
C  3.787154 0.394372 0.139205
C  2.408169 0.580767 0.693492
C  4.859306 0.596496 1.044094
C  4.061326 0.039724 -1.209101
C  6.16868 0.433385 0.575262
C  5.394852 -0.115496 -1.644844
C  6.472468 0.079648 -0.751161
H  -2.428867 -1.75361 -1.651826
H  -5.903366 1.163516 1.666015
H  -1.720014 2.171092 1.178509
H  -6.874074 -0.750834 0.474126
H  -3.939635 2.626389 2.207438
H  -4.408008 -3.186483 -2.14475
H  -6.638262 -2.689458 -1.096307
H  0.023365 0.748034 1.339011
H  1.353841 -0.031726 -1.113429
H  4.646948 0.874463 2.080406
H  3.255848 -0.110772 -1.935889
H  5.60013 -0.387526 -2.684929
H  7.513505 -0.034818 -1.065875
