program: Gaussian 09
title: 000052910
version: EM64L-G09RevD.01
frameworkgroup: C1[X(C22H16N4O9S3)]
method: RPBEPBE
basis: SDD
operation: Freq
keyword: #p
keyword: freq=noraman
keyword: PBEPBE/SDD
title: #p freq=noraman PBEPBE/SDD
converged: YES YES NO NO
title: Mulliken charges:
elementType: S S S O O O O O O O O O N N N N C C C C C C C C C C C C C C C C C C C C C C H H H H H H H H H H H H H H H H
charge: 0.970373 0.992376 0.977825 -0.557503 -0.562293 -0.485517 -0.488409 -0.485943 -0.489981 -0.559086 -0.493577 -0.530034 -0.234814 -0.053427 -0.052011 -0.677242 0.413454 0.573320 -0.162493 -0.264229 0.012758 -0.403720 -0.078524 -0.383892 -0.287438 -0.327492 0.421267 0.365925 0.409441 -0.390771 -0.392826 -0.358128 -0.354477 -0.384666 -0.315951 -0.372128 0.549445 -0.396111 0.318124 0.286846 0.336238 0.263741 0.282746 0.285302 0.236495 0.244859 0.279570 0.239760 0.234254 0.388077 0.388325 0.369405 0.319115 0.383642
chargesum: 0.00000
title: Mulliken charges with hydrogens summed into heavy atoms:
elementType: S S S O O O O O O O O O N N N N C C C C C C C C C C C C C C C C C C C C C C
charge: 0.970373 0.992376 0.977825 -0.169426 -0.173968 -0.485517 -0.488409 -0.485943 -0.489981 -0.175445 -0.493577 -0.530034 -0.234814 -0.053427 -0.052011 0.011278 0.413454 0.573320 -0.162493 -0.264229 0.012758 -0.085596 -0.078524 -0.097046 0.048800 -0.063752 0.421267 0.365925 0.409441 -0.108025 -0.107525 -0.121633 -0.109618 -0.105096 -0.315951 -0.132368 0.549445 -0.161856
polarizability: 9.01572703e+02 2.86661413e+01 4.14696237e+02 -8.34712870e+00 -3.39973970e+00 2.03523048e+02
1716.lowfreq: -2.2428 0.0013 0.0018 0.0023 1.2589 3.4982 12.0997 15.0395 20.6620
frequency: 11.9883 14.9639 20.6601 26.5893 33.1674 36.9562 47.3949 53.1438 57.9352 70.7088 83.3633 90.6354 105.9070 109.3501 123.1514 137.0002 151.5447 158.7279 168.5743 171.1296 177.8393 180.1144 196.8373 206.6002 209.7642 223.9618 233.0297 241.6828 246.8662 258.2308 275.1379 278.5835 289.9873 304.2185 312.3788 321.8498 327.9651 333.5007 335.3157 350.7042 352.2898 366.4154 386.8744 403.9562 410.1123 412.0465 422.6728 432.0542 442.4505 454.2610 472.6130 490.9682 504.7244 515.1337 527.7463 533.5542 543.2205 545.0746 555.6891 579.5393 597.6426 601.8615 609.9697 619.6528 633.3882 652.8839 666.0504 680.1432 695.6187 713.8659 729.2818 736.8136 748.6464 764.2877 768.9323 813.1286 814.9823 830.4372 832.9033 837.3797 838.8230 850.0488 854.9456 859.4567 868.8252 910.1007 917.7432 924.0517 946.3726 956.4723 963.8922 968.7457 972.8702 978.1648 980.2151 984.0608 989.9958 1004.1449 1028.0772 1038.9538 1047.6134 1048.2623 1051.1650 1061.2138 1074.4499 1079.8168 1089.5733 1120.1482 1137.0164 1175.1243 1177.2485 1198.5060 1236.4036 1255.7849 1276.2845 1302.2640 1309.2460 1311.4753 1336.3766 1344.4508 1352.1198 1358.5204 1383.9979 1386.1578 1393.3287 1418.0333 1430.7266 1440.2372 1479.4005 1498.9654 1525.9212 1533.7757 1539.7710 1557.6706 1582.7530 1596.3392 1614.7315 1616.4454 1629.3278 1652.8742 3133.3306 3143.4721 3145.7231 3148.7027 3151.4095 3158.4266 3158.8673 3168.5698 3184.3116 3186.9561 3187.3107 3404.1399 3473.3508 3479.2540 3481.3073 3646.9812
redmass: 9.5778 8.0643 8.7273 10.0457 8.1638 10.6269 7.3882 4.2950 8.6369 6.7024 6.2885 10.2195 9.1635 5.9006 6.1430 7.5596 8.7084 5.1419 3.7726 2.4435 1.7800 4.4062 3.2939 2.9822 4.4387 5.6116 6.3574 4.0734 3.7540 7.3098 3.1083 5.8067 4.4029 6.6808 8.0155 7.2820 9.8330 9.4300 7.0129 7.4369 6.0511 7.4489 5.9693 6.0709 8.6228 3.0276 10.8527 7.2902 2.1020 6.3436 1.5031 3.6366 6.4510 6.8078 5.0595 5.5355 8.2190 7.9232 6.5766 6.2840 3.2513 4.5861 6.1395 7.1102 7.0512 9.2074 7.6358 7.8930 1.1974 3.0701 7.0400 3.4482 3.2479 7.2310 7.2155 2.9792 12.2466 1.5539 11.3147 11.6690 1.4773 3.4699 1.6658 2.2452 5.4490 1.5584 11.8577 1.4370 11.8633 1.6106 10.2444 1.3847 14.9035 1.3648 1.4147 1.4095 5.8439 3.6057 3.8214 2.2771 1.2150 1.2074 1.2543 1.5939 2.5509 3.3607 5.0896 1.9424 1.4560 1.7697 1.1690 1.1655 2.2098 2.0318 1.6604 1.8162 3.0399 1.5040 3.1288 5.1202 3.6272 3.1516 7.2554 3.3663 2.5390 5.2114 3.9788 4.4894 5.8209 3.3635 4.8424 3.8628 5.4028 9.0967 7.6628 8.3261 5.7037 7.6995 1.9094 2.1731 1.0875 1.0929 1.0908 1.0902 1.0905 1.0955 1.0934 1.0885 1.0947 1.0958 1.0980 1.0579 1.0660 1.0662 1.0662 1.0933
irintensity: 0.7854 0.5848 1.4161 1.1325 0.9036 0.5322 0.7807 0.8115 0.3528 0.6019 0.8665 0.5752 1.3307 2.4800 1.4190 0.5453 1.3353 4.2582 19.5520 56.9345 16.0471 16.6314 9.6771 12.5346 3.9611 12.8174 16.1104 30.5698 52.1194 12.5909 22.6188 7.5706 63.4031 27.7933 26.0316 10.7907 9.2242 24.3196 1.1739 2.7233 1.7262 6.1920 17.5650 38.6991 59.4310 0.0029 169.6622 19.5644 49.2751 17.6861 90.8296 17.1631 47.8717 13.0616 129.8468 29.8957 161.6346 67.6074 20.7604 40.4327 5.2179 14.5172 18.3856 48.2967 11.6199 4.3436 15.3195 5.3641 171.2177 0.9710 5.8845 7.7739 13.9409 6.9817 10.3899 2.4020 80.3151 75.3826 64.6104 86.3276 11.8975 13.9879 50.3347 66.7576 3.4322 4.2684 4.2497 13.1861 72.3275 13.6522 86.8571 2.5835 78.9120 2.4894 2.0825 1.2821 13.2870 2.1567 8.7687 3.5610 86.5952 110.6656 51.8429 5.0983 57.3170 11.6875 3.6155 0.5136 3.0056 4.3280 23.9013 43.4973 60.3977 3.3522 95.1463 14.1093 5.7818 5.1098 10.9505 14.4500 30.3368 94.7249 12.6547 2.1120 25.7727 14.9718 7.0430 12.8234 418.0197 65.1297 31.1568 23.4051 10.3315 1.3349 1.8750 2.8304 206.7822 2.6095 7.2775 517.0778 14.8356 55.8007 11.5581 15.2449 0.2333 13.7866 8.6972 10.5184 0.2925 0.6264 1.6874 291.1686 46.8650 61.4526 55.4398 84.6200
temp: 298.150 k
press: 1.00000 atm
elementType: 16 16 16 8 8 8 8 8 8 8 8 8 7 7 7 7 6 6 6 6 6 6 6 6 6 6 6 6 6 6 6 6 6 6 6 6 6 6 1 1 1 1 1 1 1 1 1 1 1 1 1 1 1 1
symmnumber: 1
zpe: 929428.6 jmol-1
zpe.correction: 0.354001 hartree
zpe.thermalcorrener: 0.390386 hartree
zpe.thermalcorrenthalpy: 0.391330 hartree
zpe.thermalcorrgfe: 0.282135 hartree
zpe.sumelectzpe: -2934.928452 hartree
zpe.sumelectthermal: -2934.892067 hartree
zpe.sumelectthermalent: -2934.891123 hartree
zpe.sumelectthermalfe: -2935.000318 hartree
dipole: 6.3119 2.1608 -0.7554
dipole: 6.7142
quadrupole: -270.8613 -229.3878 -249.3696
quadrupole: 47.5313 -0.0004 -24.3953
quadrupole: -20.9883 20.4851 0.5033 47.5313 -0.0004 -24.3953
hfenergy: -2935.2824528 hartree
pointgroup: C01 [X(C22H16N4O9S3)]
dipole: -2.4960162 -0.800531 -0.3268989 debye
polarizability: 902.3239735|21.8395435|413.0953608|5.9396445|14.2284488|204.3726531 unknown
InChI: InChI=1S/C22H16N4O9S3/c23-18-7-3-13(9-21(18)38(33,34)35)12-1-4-14(5-2-12)26-24-19-8-6-16-17(22(19)25-26)10-15(36(27,28)29)11-20(16)37(30,31)32/h1-11,27,30,33H,23H2
charge 0 multiplicity 1
54 atoms
S  7.62256 1.892621 0.024509
S  5.994964 -3.412816 0.291336
S  -8.832249 1.12183 0.638537
O  7.299507 2.544391 1.731644
O  6.226368 -3.658752 -1.532471
O  9.000758 1.050403 0.008986
O  7.416334 3.108138 -1.023203
O  7.431055 -3.558776 1.018951
O  4.716115 -4.267254 0.7866
O  -8.865477 0.571474 2.414353
O  -8.199716 2.607254 0.577625
O  -10.317684 0.854661 0.020256
N  0.302334 0.717927 -0.159519
N  1.293621 -0.242305 -0.070152
N  0.721881 2.033572 -0.219157
N  -9.428401 -1.76435 -0.534526
C  3.807715 0.086749 -0.004929
C  4.818192 1.131567 -0.031225
C  2.438399 0.517276 -0.073153
C  6.170134 0.678737 0.048173
C  2.092448 1.908976 -0.164081
C  4.173947 -1.283134 0.081817
C  5.524456 -1.606818 0.149515
C  4.432208 2.528793 -0.123589
C  6.564655 -0.654157 0.137766
C  3.102175 2.921006 -0.188182
C  -1.082683 0.367066 -0.192752
C  -3.836207 -0.328957 -0.269987
C  -5.274382 -0.694393 -0.317105
C  -1.463396 -0.990817 -0.084367
C  -2.05714 1.382767 -0.336417
C  -2.827685 -1.324383 -0.122473
C  -3.415626 1.028246 -0.376268
C  -6.278765 0.214092 0.091155
C  -7.632543 -0.152396 0.022585
C  -5.711727 -1.977371 -0.770614
C  -8.099526 -1.421011 -0.442769
C  -7.062206 -2.328889 -0.838563
H  3.402901 -2.060151 0.106522
H  5.216945 3.288027 -0.156184
H  7.620213 -0.941018 0.207638
H  2.826502 3.976504 -0.259203
H  -0.696285 -1.759255 0.037213
H  -1.740832 2.42462 -0.426545
H  -3.111305 -2.374705 -0.000405
H  -4.15714 1.81998 -0.525181
H  -6.022708 1.204932 0.481047
H  -4.969993 -2.704424 -1.118151
H  -7.352136 -3.315979 -1.216219
H  8.014978 3.212059 1.945834
H  6.609041 -4.573586 -1.674115
H  -10.153977 -1.059416 -0.355065
H  -9.691162 -2.690697 -0.861115
H  -9.46046 1.203941 2.914525
