program: Gaussian 09
title: 000052874
version: EM64L-G09RevD.01
frameworkgroup: C1[X(C12H11NO5)]
method: RPBEPBE
basis: SDD
operation: Freq
keyword: #p
keyword: freq=noraman
keyword: PBEPBE/SDD
title: #p freq=noraman PBEPBE/SDD
converged: YES YES NO NO
title: Mulliken charges:
elementType: O O O O O N C C C C C C C C C C C C H H H H H H H H H H H
charge: -0.228360 -0.411091 -0.242643 -0.199287 -0.197071 0.024072 -0.528450 -0.484860 0.517342 0.192144 -0.255435 -0.306907 -0.505281 -0.381327 0.362909 -0.197729 -0.360950 0.184654 0.243756 0.274832 0.287998 0.262494 0.276103 0.221901 0.295915 0.240294 0.243923 0.292483 0.378572
chargesum: 0.00000
title: Mulliken charges with hydrogens summed into heavy atoms:
elementType: O O O O O N C C C C C C C C C C C C
charge: -0.228360 -0.032519 -0.242643 -0.199287 -0.197071 0.024072 -0.009862 0.065633 0.517342 0.192144 0.020668 -0.085006 -0.209365 -0.141034 0.362909 0.046193 -0.068468 0.184654
polarizability: 2.98813363e+02 -7.44242655e+00 1.58368348e+02 -3.11638101e+00 7.02709719e-02 7.24236247e+01
1716.lowfreq: -11.7086 -0.0009 0.0004 0.0005 1.4868 2.2432 14.2076 22.3671 38.0129
frequency: 13.9497 22.1804 38.0038 43.3055 50.5330 71.9083 92.9551 119.5786 146.0696 169.7476 176.5829 201.1253 274.3967 280.2251 285.5968 369.3456 418.0972 425.2171 479.5858 496.7233 512.6911 537.6568 550.4006 570.6095 586.6781 650.8308 655.3472 681.3076 696.7374 701.5799 767.6234 789.6277 820.2461 872.2342 877.6232 896.4515 936.9476 939.9371 950.2782 987.7653 1002.4413 1007.4761 1021.3104 1042.0962 1077.6003 1088.7393 1091.3029 1123.7300 1149.8986 1180.3746 1207.7913 1226.7030 1233.4075 1252.9965 1287.8659 1295.8629 1315.6876 1329.7647 1375.4659 1377.2202 1396.0574 1436.2925 1437.3478 1443.9820 1480.3538 1566.4165 1578.6030 1614.1505 1650.8041 1661.9112 2971.6228 3001.4589 3022.0033 3074.7320 3099.6155 3120.3902 3146.7606 3165.3010 3167.7327 3188.7207 3512.1199
redmass: 8.1985 7.6190 6.7290 4.3351 13.2646 3.1399 5.8750 5.1402 2.5596 4.4274 6.5311 6.5820 7.6451 3.1159 6.7113 8.0273 5.7338 3.1854 3.2327 2.7456 2.8557 4.4074 3.3968 5.2927 4.1857 1.4366 6.5962 2.1853 5.9384 4.7740 6.4527 1.8385 1.5210 3.1869 2.3050 3.6961 3.9107 1.4849 1.4360 6.1225 1.3823 1.8904 1.3456 3.5381 2.1314 1.8774 1.7090 1.9199 1.2861 1.2070 2.4333 2.8859 1.3405 1.3367 1.8210 1.4993 1.3125 2.0954 2.8820 4.5326 5.2827 1.1738 2.8338 1.0938 2.6707 8.2122 6.1952 6.8778 5.8390 7.9678 1.0620 1.0658 1.0956 1.0947 1.0906 1.0902 1.0875 1.0937 1.0932 1.0966 1.0639
irintensity: 1.4509 1.4582 0.5477 1.9194 1.5008 0.3898 1.0869 2.8390 0.9699 0.5863 1.8325 11.3618 1.4416 0.7179 2.6412 6.0300 22.7160 0.5258 12.5915 1.3411 65.4343 20.8626 27.6745 5.6608 13.5771 124.1312 14.2529 24.9092 8.7054 22.8726 17.0931 8.3373 42.0081 4.8029 12.4942 8.8476 3.3918 0.0713 6.9392 0.9661 3.4587 47.6092 41.7399 76.9660 332.4618 35.1583 21.5700 50.5726 2.3966 56.2999 158.5994 115.8693 41.7071 22.9752 26.4058 1.1226 38.2301 211.7208 6.6890 106.3533 50.5262 6.4706 42.0004 69.1556 43.1871 244.0139 1.6542 1.8725 127.0083 182.1772 38.8347 27.7214 7.3676 6.4968 0.0542 11.8633 4.0716 5.8264 8.9428 5.4409 27.4412
temp: 298.150 k
press: 1.00000 atm
elementType: 8 8 8 8 8 7 6 6 6 6 6 6 6 6 6 6 6 6 1 1 1 1 1 1 1 1 1 1 1
symmnumber: 1
zpe: 553762.2 jmol-1
zpe.correction: 0.210917 hartree
zpe.thermalcorrener: 0.228070 hartree
zpe.thermalcorrenthalpy: 0.229014 hartree
zpe.thermalcorrgfe: 0.161500 hartree
zpe.sumelectzpe: -893.361465 hartree
zpe.sumelectthermal: -893.344312 hartree
zpe.sumelectthermalent: -893.343368 hartree
zpe.sumelectthermalfe: -893.410882 hartree
dipole: 2.6428 4.7006 -1.2679
dipole: 5.5396
quadrupole: -123.9169 -106.7620 -105.7256
quadrupole: -14.8403 -2.8125 -3.1594
quadrupole: -11.7820 5.3728 6.4092 -14.8403 -2.8125 -3.1594
hfenergy: -893.5723819 hartree
pointgroup: C01 [X(C12H11N1O5)]
dipole: -1.0436023 1.8372632 0.5342431 debye
polarizability: 298.7562497|7.8870115|158.3856622|-3.5015456|1.4422382|72.4634245 unknown
InChI: InChI=1S/C12H11NO5/c14-11(6-7-12(15)16)5-4-9-2-1-3-10(8-9)13(17)18/h1-5,8,15H,6-7H2
charge 0 multiplicity 1
29 atoms
O  -2.28888 -1.801586 -0.165115
O  -7.236949 -0.578577 0.244128
O  -6.170001 1.139998 -0.89263
O  6.305767 -0.287564 -0.197847
O  4.946969 -2.115332 -0.316176
N  5.141903 -0.844154 -0.216487
C  -3.587689 0.25776 0.088804
C  -4.832018 -0.633977 0.201115
C  1.516706 0.279891 -0.04246
C  -2.288982 -0.541355 -0.019877
C  0.193589 -0.358968 -0.068034
C  -1.027836 0.250866 0.028202
C  2.668175 -0.547221 -0.138531
C  1.703755 1.690266 0.073315
C  3.947613 0.039007 -0.115896
C  2.994506 2.253686 0.093272
C  4.139537 1.431901 -0.00137
C  -6.094158 0.091295 -0.212651
H  -3.514957 0.95654 0.945658
H  -3.675774 0.907586 -0.807359
H  -4.706449 -1.520923 -0.451573
H  -4.962199 -1.04082 1.218456
H  0.175759 -1.453905 -0.17599
H  -1.129825 1.337917 0.141628
H  2.578817 -1.634242 -0.229215
H  0.832825 2.349745 0.146073
H  3.114621 3.337942 0.181772
H  5.153405 1.839803 0.010872
H  -8.048527 -0.099977 -0.078783
