program: Gaussian 09
title: 000053090
version: EM64L-G09RevD.01
frameworkgroup: C1[X(C22H30N4)]
method: RPBEPBE
basis: SDD
operation: Freq
keyword: #pfreq=noraman
keyword: PBEPBE/SDD
title: #p freq=noraman PBEPBE/SDD
converged: YES YES NO NO
title: Mulliken charges:
elementType: N N N N C C C C C C C C C C C C C C C C C C C C C C H H H H H H H H H H H H H H H H H H H H H H H H H H H H H H
charge: -0.078648 -0.259457 -0.087490 -0.091755 -0.350449 -0.351887 0.306217 0.121371 0.205765 -0.397796 -0.356605 -0.358484 -0.387146 0.343433 -0.370838 -0.223949 -0.268865 -0.615654 -0.617984 -0.616423 -0.617679 -0.416691 -0.402615 -0.243577 -0.235727 -0.251528 0.207940 0.218925 0.229763 0.195017 0.275516 0.189646 0.238927 0.215034 0.216578 0.258013 0.240317 0.220194 0.220162 0.219815 0.189721 0.232149 0.222425 0.188961 0.223173 0.220026 0.194700 0.222508 0.191774 0.226884 0.220610 0.242364 0.231221 0.223277 0.222130 0.226693
chargesum: 0.00000
title: Mulliken charges with hydrogens summed into heavy atoms:
elementType: N N N N C C C C C C C C C C C C C C C C C C C C C C
charge: -0.078648 -0.259457 -0.087490 -0.091755 0.076416 0.072893 0.306217 0.121371 0.205765 -0.122280 0.071967 0.073128 -0.129133 0.343433 -0.130522 -0.003755 -0.048703 0.026030 0.016575 0.020811 0.021590 -0.174327 -0.171394 -0.020300 -0.013597 -0.024835
polarizability: 3.31133325e+02 -6.96264378e+00 2.11580263e+02 -1.71276609e+01 1.64126071e+01 2.79440415e+02
1716.lowfreq: -7.8456 -6.4873 -0.0004 0.0003 0.0005 3.7415 10.4949 15.3363 18.7913
frequency: 6.4359 14.7774 18.5483 26.3687 27.4937 50.6302 51.3504 74.0035 84.1021 90.0631 104.5195 139.4088 143.2379 161.4895 192.2011 203.8334 208.8129 213.0025 218.0133 222.4957 241.0485 243.5432 265.0136 288.3547 315.4619 330.4213 349.6792 366.1726 380.2997 406.9062 412.3095 424.7386 432.9558 439.9847 465.4450 496.3745 549.5444 551.2563 574.2566 600.2879 604.5133 616.2456 636.9092 642.7458 703.3316 729.4028 754.4842 755.9614 765.4039 769.2221 793.4275 798.5468 807.6211 817.6859 827.3489 851.1155 860.3409 914.5973 919.9091 941.0477 958.5170 972.9597 975.6748 988.3950 990.7913 1002.2956 1010.5520 1027.1593 1031.0216 1032.2809 1032.9820 1037.3389 1057.9913 1069.5356 1079.3160 1084.1564 1086.5355 1091.2316 1098.5999 1114.7215 1120.5563 1138.9286 1141.0113 1146.8661 1160.5768 1171.3389 1186.4342 1190.8018 1191.7909 1201.3636 1244.9862 1254.1763 1256.1298 1263.0061 1267.4333 1289.1471 1298.4930 1306.5557 1311.6488 1315.7976 1332.0201 1342.4226 1365.9664 1374.0418 1377.8749 1400.7842 1405.8310 1420.3242 1421.0716 1436.2462 1442.0142 1443.4629 1452.8169 1459.5890 1461.7310 1462.7905 1465.3699 1467.9054 1468.5518 1474.7740 1475.4722 1475.8612 1479.6279 1481.5414 1483.8477 1485.9333 1488.0861 1550.4559 1573.6604 1584.7437 1615.2775 1625.4035 2848.6683 2854.1640 2856.0791 2864.0910 2872.2928 2887.9483 2916.6937 2930.3824 3019.7010 3020.8336 3026.2786 3027.6135 3035.8235 3039.4125 3055.7048 3067.3255 3078.3579 3079.6662 3083.5541 3084.1827 3118.1980 3124.9734 3126.4019 3138.6251 3141.6736 3149.7848 3158.0710 3163.7652 3169.0412 3221.0194
redmass: 2.8791 3.6364 2.9777 3.5021 4.0034 3.9217 3.8368 4.2632 3.6045 2.9731 2.1179 2.7544 3.2070 2.7146 2.9826 2.1907 1.4756 1.3308 1.4605 2.7053 2.1640 1.3072 2.4969 3.8030 4.1161 2.8149 2.9877 2.5726 3.7480 2.8646 2.5545 2.8273 2.8724 2.3998 3.2781 3.5709 4.1493 3.9963 6.2602 4.0916 4.5169 6.0697 4.8657 3.4982 1.8025 4.6704 1.6697 1.9518 4.2075 2.0534 1.4206 1.5288 1.8327 1.9931 4.0367 1.2635 1.4093 2.3807 2.2285 1.3696 5.6756 1.3767 1.3553 4.9404 1.3199 3.1666 2.0659 2.3059 2.2778 1.7049 1.4764 1.8184 2.2006 2.5120 1.6257 1.7218 1.6104 1.3945 2.0682 1.7750 2.2452 1.4906 1.5697 1.7097 1.3546 1.0542 1.6662 1.7170 1.3077 2.0178 1.6172 2.0381 1.6919 2.3296 2.4644 1.4327 1.6896 1.3092 1.8278 1.3769 1.6181 1.6259 2.6098 6.9779 1.3859 1.4876 4.1002 1.1414 1.1517 2.3476 1.1594 1.1583 4.1676 1.0642 1.0555 1.0630 1.0689 1.7500 1.3179 1.0591 1.0690 1.0614 1.0865 2.8335 1.0689 1.0568 1.0756 5.8834 6.2052 6.6191 6.1700 7.7142 1.0573 1.0566 1.0637 1.0579 1.0629 1.0683 1.0690 1.0678 1.0731 1.0729 1.0730 1.0730 1.0863 1.0876 1.0936 1.0928 1.1008 1.1006 1.1005 1.1004 1.0848 1.0868 1.0854 1.0926 1.0903 1.0952 1.0955 1.1008 1.0987 1.0970
irintensity: 0.3453 0.1548 0.2922 0.2191 0.2268 0.5958 0.1337 0.7596 0.1793 0.0989 1.0401 0.1789 1.6261 2.1987 0.0360 0.1911 1.0668 0.7404 0.1732 3.8970 0.6142 1.1134 2.3895 0.2531 3.9592 1.4785 10.9581 3.8170 2.0845 0.2918 1.8467 5.8696 5.2418 0.3540 4.7629 7.8564 1.0494 4.9621 5.2778 7.4291 2.8794 0.6101 8.8514 6.0580 45.4562 1.0403 112.0440 8.3701 8.1565 50.8030 3.9319 5.5228 20.5895 7.7951 19.3135 0.1168 0.5572 7.1451 2.1002 2.4324 9.2125 0.6877 0.3232 0.5451 0.6675 0.6152 15.2107 3.1305 25.6703 63.4565 10.9822 31.8023 21.6190 27.5819 13.5074 0.7854 7.8529 9.4503 18.6489 12.3117 4.7830 1.3029 1.5913 4.5176 29.2493 0.0892 35.0066 9.0027 3.1950 18.0487 14.1205 6.0509 15.8027 5.2749 8.4136 3.5439 2.1284 0.9216 36.4706 0.8819 6.9527 0.3680 0.5797 0.1112 0.3991 6.1793 19.0480 3.9169 3.7268 10.7694 4.5063 1.6742 23.9262 6.2820 3.0047 17.3913 9.7573 5.8340 3.6984 15.6254 34.5224 9.3744 6.5015 9.2990 2.5621 15.4022 21.2057 40.1369 1.5447 2.0181 54.0680 4.3985 78.5226 62.1444 77.6130 117.4356 157.4910 116.2020 29.0507 74.8977 46.3622 34.4785 41.9331 54.0512 1.9150 10.0618 23.9279 55.2862 30.3338 33.2900 62.8499 51.0976 8.0759 0.2626 2.4619 28.8327 25.6398 26.2127 22.0372 30.3562 18.3036 0.4588
temp: 298.150 k
press: 1.00000 atm
elementType: 7 7 7 7 6 6 6 6 6 6 6 6 6 6 6 6 6 6 6 6 6 6 6 6 6 6 1 1 1 1 1 1 1 1 1 1 1 1 1 1 1 1 1 1 1 1 1 1 1 1 1 1 1 1 1 1
symmnumber: 1
zpe: 1250394.4 jmol-1
zpe.correction: 0.476250 hartree
zpe.thermalcorrener: 0.502820 hartree
zpe.thermalcorrenthalpy: 0.503764 hartree
zpe.thermalcorrgfe: 0.414679 hartree
zpe.sumelectzpe: -1073.332260 hartree
zpe.sumelectthermal: -1073.305691 hartree
zpe.sumelectthermalent: -1073.304747 hartree
zpe.sumelectthermalfe: -1073.393832 hartree
dipole: -1.8239 0.3168 -0.7385
dipole: 1.9931
quadrupole: -147.1662 -152.3090 -152.5534
quadrupole: 4.3537 -1.3583 2.3711
quadrupole: 3.5100 -1.6328 -1.8772 4.3537 -1.3583 2.3711
hfenergy: -1073.8085104 hartree
pointgroup: C01 [X(C22H30N4)]
dipole: 0.6986948 -0.2120258 -0.2858791 debye
polarizability: 329.349232|-16.7631623|211.5139766|16.1313817|-12.4259771|281.2907936 unknown
InChI: InChI=1S/C22H30N4/c1-23(2)14-16-25(17-15-24(3)4)26-18-21(19-10-6-5-7-11-19)20-12-8-9-13-22(20)26/h5-13,18H,14-17H2,1-4H3
charge 0 multiplicity 1
56 atoms
N  2.051381 -0.461495 -0.385374
N  0.718348 -0.128136 0.00701
N  3.34071 3.035045 -1.232978
N  1.826298 -4.265281 -0.698579
C  2.678614 0.624394 -1.199465
C  2.124916 -1.809381 -1.028211
C  0.321454 0.036712 1.342503
C  -1.087387 0.333065 1.336847
C  -1.528089 0.337374 -0.057657
C  -0.393873 0.058554 -0.830628
C  2.80216 1.935876 -0.399192
C  1.733765 -2.933702 -0.049459
C  1.089229 -0.037907 2.523093
C  -2.882753 0.582189 -0.591059
C  -1.724635 0.592779 2.58145
C  0.423189 0.204226 3.740564
C  -0.967464 0.524219 3.767034
C  3.02609 4.367427 -0.676088
C  4.781032 2.893821 -1.529205
C  0.670251 -4.561974 -1.572458
C  2.055905 -5.352307 0.276666
C  -4.046039 0.18119 0.126096
C  -3.064423 1.215487 -1.854448
C  -5.336706 0.404762 -0.39944
C  -4.353678 1.430212 -2.384198
C  -5.50006 1.029897 -1.657475
H  2.119038 0.835514 -2.139284
H  3.677753 0.247783 -1.482314
H  3.174166 -1.964802 -1.333246
H  1.501115 -1.857778 -1.950688
H  -0.311873 -0.05638 -1.909892
H  3.419022 1.748615 0.516177
H  1.794713 2.233027 -0.055589
H  0.714849 -2.742865 0.368139
H  2.440293 -2.905953 0.799998
H  2.156995 -0.270643 2.477496
H  -2.784731 0.862655 2.622187
H  0.981807 0.155158 4.682105
H  -1.451549 0.724186 4.729608
H  3.359757 5.151251 -1.37998
H  3.512458 4.56447 0.313066
H  1.934304 4.468128 -0.545662
H  4.978034 1.946622 -2.060463
H  5.421852 2.915681 -0.61025
H  5.102764 3.718122 -2.1904
H  0.556405 -3.781171 -2.343791
H  -0.295279 -4.632392 -1.009648
H  0.837165 -5.523093 -2.091029
H  1.211359 -5.490318 0.998696
H  2.972967 -5.147185 0.856722
H  2.199534 -6.306412 -0.262165
H  -3.935294 -0.343602 1.080876
H  -2.184688 1.562947 -2.409366
H  -6.216247 0.081783 0.169484
H  -4.466291 1.922475 -3.357119
H  -6.50253 1.203434 -2.064213
