program: Gaussian 09
title: 000052855
version: EM64L-G09RevD.01
frameworkgroup: C1[X(C8H9NOS2)]
method: RPBEPBE
basis: SDD
operation: Freq
keyword: #p
keyword: freq=noraman
keyword: PBEPBE/SDD
title: #p freq=noraman PBEPBE/SDD
converged: YES YES NO NO
title: Mulliken charges:
elementType: S S O N C C C C C C C C H H H H H H H H H
charge: 0.057464 0.058712 -0.435410 -0.006983 0.276152 0.442930 -0.823139 -0.877660 0.079570 0.017200 -0.531315 -0.814429 0.305535 0.298243 0.310058 0.269026 0.251027 0.228772 0.232187 0.282512 0.379548
chargesum: 0.00000
title: Mulliken charges with hydrogens summed into heavy atoms:
elementType: S S O N C C C C C C C C
charge: 0.057464 0.058712 -0.055862 -0.006983 0.276152 0.442930 -0.219361 -0.298576 0.079570 0.017200 -0.280288 -0.070958
polarizability: 1.69366420e+02 5.46916237e+00 1.39484169e+02 7.42483903e-01 2.21030736e+00 7.25741918e+01
1716.lowfreq: -11.9313 -6.7755 0.0019 0.0020 0.0023 9.4259 51.1340 93.3957 126.2806
frequency: 50.9574 93.3903 126.2713 147.8527 203.9180 208.7807 266.9195 288.0268 292.4342 306.8650 321.1854 355.2199 420.2453 470.7942 490.4364 534.5525 555.8938 575.8963 625.0170 698.8836 711.5166 746.6449 761.9404 857.4470 879.0712 887.7210 920.5807 961.5246 1041.7973 1075.6648 1160.9351 1169.9743 1189.6443 1203.2028 1229.5258 1263.4358 1266.7238 1305.3964 1336.4203 1381.7585 1397.9198 1410.2280 1416.2609 1448.1170 1476.4838 1477.0231 1549.1306 1581.7585 2957.8667 3013.9439 3016.4271 3029.8142 3078.1151 3082.0329 3113.4670 3120.2067 3582.5447
redmass: 4.2276 5.9806 3.0455 1.0707 6.0838 3.3303 3.4915 4.8705 4.5988 3.7396 1.9522 1.6503 22.4979 5.3012 5.0596 4.8887 4.9492 4.5450 5.4388 6.3045 5.1896 3.4987 5.8890 1.6993 2.4453 2.3210 1.6963 1.8669 1.5333 4.0550 1.3598 1.1567 1.3044 3.1958 1.7046 1.7554 1.7485 1.5470 4.6570 2.1366 1.9129 1.1145 1.1330 1.5075 1.0554 1.6240 6.2180 7.4377 1.0402 1.0575 1.0578 1.0980 1.1030 1.1048 1.0942 1.0911 1.0655
irintensity: 0.7736 0.9722 2.4093 0.0683 0.1983 1.4490 4.7981 3.8844 0.6938 3.2450 49.5899 78.4573 0.2496 21.8164 0.3208 2.9265 0.2640 4.8523 0.5162 9.7644 8.7761 1.0186 6.8247 0.7450 13.7095 20.5689 11.8349 11.5593 3.8261 11.6464 103.6206 5.2619 77.8256 27.4268 6.5351 3.1037 4.2056 9.0589 10.1176 88.1323 13.2239 8.5316 44.2804 10.1115 17.7811 16.6202 18.6810 7.2391 26.7200 10.8207 1.5575 21.5025 3.7387 1.8200 3.2863 15.8936 46.2366
temp: 298.150 k
press: 1.00000 atm
elementType: 16 16 8 7 6 6 6 6 6 6 6 6 1 1 1 1 1 1 1 1 1
symmnumber: 1
zpe: 407542.6 jmol-1
zpe.correction: 0.155225 hartree
zpe.thermalcorrener: 0.166960 hartree
zpe.thermalcorrenthalpy: 0.167904 hartree
zpe.thermalcorrgfe: 0.117243 hartree
zpe.sumelectzpe: -1235.457857 hartree
zpe.sumelectthermal: -1235.446122 hartree
zpe.sumelectthermalent: -1235.445178 hartree
zpe.sumelectthermalfe: -1235.495838 hartree
dipole: -2.8711 -0.9318 -0.1349
dipole: 3.0215
quadrupole: -84.9536 -82.3481 -87.2396
quadrupole: 11.8556 -1.6387 -0.8657
quadrupole: -0.1065 2.4990 -2.3925 11.8556 -1.6387 -0.8657
hfenergy: -1235.6130817 hartree
pointgroup: C01 [X(C8H9N1O1S2)]
dipole: 1.1300783 -0.3563767 0.0951082 debye
dipolederiv: -0.0661711 -0.0556445 -0.0366674 -0.0502836 -0.0703647 -0.0949419 -0.0502299 -0.0052455 -0.0666548 -0.2334213 0.0190733 0.0672869 0.0358905 -0.040349 -0.0436642 -0.0090608 0.0236148 -0.0792954 -0.2946534 0.3052345 0.0141614 0.4617925 -1.1704642 -0.0285333 0.0238312 -0.053807 -0.3918163 -0.3631244 -0.0820014 -0.0100607 -0.1008333 -0.265815 -0.0082305 0.0289333 0.0021281 -0.2277307 0.024561 0.2561479 0.0576543 0.185503 0.013926 -0.0076781 0.1595321 0.0027594 -0.0492613 0.1108912 -0.1232377 -0.0526678 -0.0689521 -0.1412989 -0.0472916 -0.1530803 -0.0422718 -0.0184355 0.2663104 -0.0262407 -0.0769807 -0.0733929 -0.0735034 0.0566301 -0.1416932 0.0151806 0.0766257 0.23278 0.0890737 0.0476868 0.0908279 0.0879526 0.0641862 0.1643697 0.0113449 0.0909721 -0.1776379 -0.2639439 -0.0159528 -0.6136008 0.969135 0.0508819 -0.0028157 0.069054 0.0955036 0.5717703 -0.2414206 -0.0050946 0.1800702 -0.0990452 -0.0090063 -0.0128553 -0.0041053 -0.0275248 -0.1080429 0.0806175 -0.0008704 -0.0432684 0.2729904 0.0278674 -0.0329146 0.0185602 -0.1034625 -0.2224985 0.0485302 0.0039934 0.0454738 -0.0207064 -0.0067722 -0.0006332 -0.0088843 0.0845655 -0.0443848 -0.0210271 0.0260237 -0.0392197 0.0760712 -0.0306856 0.039061 -0.0694153 -0.0318821 0.0320446 0.0577938 -0.0172549 -0.0128068 0.061262 0.0458804 0.0407778 0.0491843 0.0824032 -0.0641187 -0.0042045 0.0103673 -0.0234686 0.0918691 -0.00731 0.0097963 -0.0567774 -0.0456224 0.0490308 -0.0985456 -0.008125 0.0125224 -0.0684729 0.0435268 -0.0510606 0.0349687 0.0910327 0.0502679 0.0845344 0.0014527 0.0690632 -0.0813315 -0.0071587 -0.0090861 0.0023597 0.1329481 0.0145462 0.0211216 -0.0050722 0.0936835 0.0172956 0.1192445 -0.0592996 0.1047398 -0.0355477 0.0158465 0.0209934 0.0071174 0.0845426 0.0372932 -0.1109016 0.0656266 -0.0981175 -0.0540504 0.0689418 -0.0311079 -0.0010329 -0.1445866 0.0048464 -0.0050502 -0.0036431 -0.0046069 0.1282074 0.1370624 -0.0357462 -0.0059645 -0.0889567 0.3987097 -0.0009929 -0.0055557 0.0093365 0.3490254 unknown
polarizability: 169.3614074|-5.1417126|138.8524827|2.6796219|-6.6392779|73.2108912 unknown
InChI: InChI=1S/C8H9NOS2/c1-5-8(10)7-4-12-11-3-6(7)2-9-5/h2,10H,3-4H2,1H3
charge 0 multiplicity 1
21 atoms
S  -3.018585 -1.291666 0.52944
S  -3.343013 0.54903 -0.773303
O  1.399193 -2.159365 -0.094893
N  1.788094 1.53009 0.023271
C  -0.288243 -0.447277 0.005057
C  -0.605178 0.941288 0.05107
C  -1.265681 -1.609324 -0.077918
C  -2.005913 1.520925 0.147208
C  1.092251 -0.78709 -0.032218
C  2.109611 0.205047 -0.01347
C  0.471252 1.86873 0.049285
C  3.577516 -0.169948 -0.042906
H  -1.335423 -1.96651 -1.119814
H  -0.897788 -2.45328 0.532156
H  -2.34375 1.576858 1.195867
H  -2.028453 2.538967 -0.281136
H  0.260329 2.944837 0.072305
H  3.871878 -0.79154 0.827021
H  3.854369 -0.715365 -0.967695
H  4.171516 0.755889 -0.009478
H  2.378618 -2.299095 -0.091949
