program: Gaussian 09
title: 000052887
version: EM64L-G09RevD.01
frameworkgroup: C1[X(C17H34N2)]
method: RPBEPBE
basis: SDD
operation: Freq
keyword: #pfreq=noraman
keyword: PBEPBE/SDD
title: #p freq=noraman PBEPBE/SDD
converged: YES YES NO NO
title: Mulliken charges:
elementType: N N C C C C C C C C C C C C C C C C C H H H H H H H H H H H H H H H H H H H H H H H H H H H H H H H H H H
charge: -0.188051 -0.126141 0.212274 -0.448554 0.180223 -0.054266 -0.508128 -0.379689 -0.729139 -0.735696 -0.362199 -0.386778 -0.686582 -0.704113 -0.381172 -0.372632 -0.353514 -0.356614 -0.696531 0.212580 0.221476 0.218190 0.240428 0.204672 0.223862 0.193134 0.226195 0.196580 0.233784 0.196256 0.219958 0.230374 0.186941 0.198380 0.191790 0.197421 0.216391 0.226431 0.213041 0.215226 0.229803 0.220185 0.194013 0.191050 0.188698 0.190851 0.188557 0.187027 0.195315 0.194334 0.209340 0.215002 0.210019
chargesum: 0.00000
title: Mulliken charges with hydrogens summed into heavy atoms:
elementType: N N C C C C C C C C C C C C C C C C C
charge: -0.188051 -0.126141 0.212274 -0.014498 0.180223 0.163923 -0.063028 0.037307 -0.072580 -0.089109 0.023122 0.002433 -0.030719 -0.038899 0.003891 0.006917 0.022070 0.033035 -0.062169
polarizability: 2.41389592e+02 -1.01077650e+01 1.92571093e+02 4.06455270e+00 4.17090535e-01 1.67636895e+02
1716.lowfreq: -8.9476 -0.0006 0.0006 0.0014 1.3870 9.5471 15.9546 24.8468 36.3759
frequency: 15.8423 24.3160 36.0562 44.3207 53.4294 56.1837 66.9795 84.0129 93.8230 116.7087 125.5017 139.9304 144.3275 151.5516 156.3796 189.6067 211.1990 212.6864 224.7630 230.4781 247.5499 251.9139 272.0796 292.1937 314.6788 335.5929 351.9103 362.4465 403.6900 435.7103 443.5442 473.0175 491.6295 508.0039 557.4157 613.9165 692.2027 718.9326 722.5569 732.2125 741.3095 763.0590 795.0977 814.4603 851.7911 866.5554 886.7070 889.0779 910.7026 920.2927 934.4598 942.4097 950.7500 968.8184 989.4705 991.0146 1010.6789 1012.6855 1024.0893 1038.6350 1052.4941 1066.6245 1073.3838 1079.7047 1081.5821 1096.6378 1121.0168 1128.2268 1146.7529 1169.8425 1180.9992 1186.5010 1201.6632 1209.2453 1217.0403 1231.6474 1245.0122 1246.2129 1247.7466 1270.8818 1279.3927 1280.5255 1285.5174 1292.6733 1295.2423 1301.6119 1308.1048 1314.8974 1334.7289 1345.7154 1351.1435 1355.4548 1356.5355 1366.2205 1372.9478 1381.1243 1389.3183 1392.0218 1402.0589 1452.0494 1459.3744 1460.1551 1461.1849 1463.3228 1464.2405 1465.5820 1467.7792 1468.5428 1469.3294 1474.0718 1475.5417 1476.9963 1480.3939 1481.8472 1485.2205 1485.9205 1488.6318 1495.2929 1574.9286 2937.9646 2949.1811 2949.9304 2951.3276 2954.6914 2961.1934 2967.7753 2971.2461 2972.3909 2972.8151 2977.3540 2977.8466 2981.1006 2982.8732 2983.0435 2988.3085 2996.8806 3006.2748 3009.1478 3022.8250 3029.1022 3034.2880 3042.3454 3067.8364 3067.8966 3069.8429 3071.9546 3073.1974 3074.1257 3079.4135 3082.9381 3086.7044 3090.2301 3091.4180
redmass: 3.5939 2.5971 2.1394 2.8423 2.8946 2.6911 3.1048 1.8322 2.6379 3.4470 1.8502 2.7353 2.7729 2.5146 2.0983 2.5311 1.0968 1.0867 2.9895 1.1425 1.0512 1.1729 2.1851 2.5452 2.8389 2.4711 2.4071 2.7899 2.8155 2.8202 2.9862 2.9996 3.3964 2.9466 2.7354 4.0523 5.0999 1.0599 1.0823 1.2544 2.4099 1.2712 3.4204 1.4268 2.0362 2.3837 1.5072 1.7913 1.2427 1.6787 1.3781 1.4014 1.2614 1.5833 4.7018 4.0642 1.4138 1.2523 2.5701 2.9573 3.1112 2.5344 2.2198 2.2028 2.2491 1.4229 2.6642 2.2362 1.4510 2.0193 2.0285 2.0437 1.9309 1.2869 1.5683 4.0304 2.2875 1.3948 1.3816 1.2756 1.0723 1.2538 1.1118 1.1538 1.1136 1.5347 1.3634 1.4274 1.3953 1.4766 1.5782 1.6655 1.6227 1.2225 1.2108 1.2903 1.2173 1.2356 2.1053 1.0516 1.0773 1.0738 1.0535 1.0778 1.0640 1.0515 1.0797 1.0604 1.0558 1.0794 1.0471 1.0432 1.0850 1.0622 1.0651 1.0864 1.0938 1.0938 8.6494 1.0662 1.0588 1.0589 1.0595 1.0595 1.0592 1.0584 1.0368 1.0561 1.0397 1.0357 1.0358 1.0680 1.0947 1.0360 1.0968 1.0997 1.0840 1.1022 1.1033 1.0963 1.1031 1.1033 1.0996 1.1007 1.0993 1.0977 1.0998 1.0990 1.1004 1.0989 1.1000 1.1002 1.0991
irintensity: 0.3024 0.0111 0.1140 0.1447 0.2579 0.1884 0.3343 0.2007 0.0589 0.4279 0.0093 0.0391 0.1125 1.1171 0.6346 0.3040 0.1171 0.0378 0.0670 0.0037 0.2803 0.3277 0.5583 0.2941 0.3428 2.8833 1.2348 0.7574 5.0722 3.0075 0.9269 0.1999 6.7294 5.1412 4.5957 6.3034 2.3088 15.4043 0.3357 0.3973 5.7930 0.6288 2.5151 0.0819 13.2672 1.1314 1.7204 4.6323 1.2690 0.2654 0.3822 2.8098 0.5315 5.7421 0.3805 1.2789 0.4162 0.4236 9.4522 6.0603 2.1427 4.1255 2.5617 0.1499 0.6601 14.1936 15.8558 14.6611 3.6385 14.7323 13.0789 8.3686 20.3135 11.3912 1.2629 91.9874 7.8819 6.8780 2.0401 14.5196 0.8523 1.7124 1.1656 7.3832 2.2942 51.2299 3.1497 9.9613 1.8217 7.2930 5.9360 0.2077 0.3109 20.0706 31.9505 13.8946 11.2222 7.8707 97.5843 3.0609 2.8307 0.0780 2.3459 2.9514 0.5384 3.6965 1.1902 4.2874 1.2664 0.7646 20.3835 11.8282 1.9373 22.1114 3.0476 3.3769 35.1547 8.9288 153.8430 55.2025 0.7429 0.4050 3.0396 0.2090 49.3741 131.7850 37.4475 17.1861 47.3734 36.8435 31.2011 44.1848 6.8617 24.0951 3.6056 1.6838 17.2925 1.4429 0.8497 32.3098 12.6878 175.7488 21.4060 92.7796 55.0241 45.7386 5.1741 51.9495 31.8137 85.7734 9.7499 43.5312 40.7604
temp: 298.150 k
press: 1.00000 atm
elementType: 7 7 6 6 6 6 6 6 6 6 6 6 6 6 6 6 6 6 6 1 1 1 1 1 1 1 1 1 1 1 1 1 1 1 1 1 1 1 1 1 1 1 1 1 1 1 1 1 1 1 1 1 1
symmnumber: 1
zpe: 1259582.1 jmol-1
zpe.correction: 0.479749 hartree
zpe.thermalcorrener: 0.504155 hartree
zpe.thermalcorrenthalpy: 0.505099 hartree
zpe.thermalcorrgfe: 0.423202 hartree
zpe.sumelectzpe: -776.142369 hartree
zpe.sumelectthermal: -776.117964 hartree
zpe.sumelectthermalent: -776.117020 hartree
zpe.sumelectthermalfe: -776.198917 hartree
dipole: -0.1452 3.0208 0.8783
dipole: 3.1493
quadrupole: -119.4388 -122.3639 -123.3764
quadrupole: 8.7911 4.3289 -2.4122
quadrupole: 2.2875 -0.6375 -1.6500 8.7911 4.3289 -2.4122
hfenergy: -776.622119 hartree
pointgroup: C01 [X(C17H34N2)]
dipole: -0.0385333 -1.166857 -0.4148724 debye
polarizability: 241.0967135|11.0404865|192.7516749|-3.2461525|1.8611876|167.7491912 unknown
InChI: InChI=1S/C17H34N2/c1-6-7-8-9-10-11-12-13-16-18-17(4,5)14-19(16)15(2)3/h15H,6-14H2,1-5H3
charge 0 multiplicity 1
53 atoms
N  3.044438 -0.574313 -0.246999
N  3.091942 1.530176 0.723769
C  4.329841 1.435073 -0.146423
C  4.404743 -0.077304 -0.582859
C  2.439823 0.387768 0.593221
C  2.720721 -2.018766 -0.245368
C  1.085684 0.155832 1.221998
C  -0.082562 0.264979 0.203676
C  4.110679 2.353539 -1.374287
C  5.56693 1.879075 0.656897
C  -1.464682 0.089034 0.869991
C  -2.638242 0.196891 -0.129754
C  3.435085 -2.788445 0.899534
C  3.026234 -2.648591 -1.622196
C  -4.023867 0.024929 0.532684
C  -5.19766 0.129251 -0.467275
C  -6.583841 -0.041248 0.194173
C  -7.757277 0.059746 -0.807307
C  -9.138295 -0.112482 -0.138444
H  5.18367 -0.62449 -0.008886
H  4.623733 -0.18751 -1.660099
H  1.629257 -2.093285 -0.078271
H  0.962706 0.928266 2.000682
H  1.045039 -0.83055 1.726245
H  -0.027254 1.255516 -0.288852
H  0.040187 -0.490655 -0.598671
H  3.24778 2.004616 -1.970556
H  5.006678 2.367952 -2.024163
H  3.899631 3.383597 -1.037942
H  6.485417 1.809961 0.043256
H  5.694185 1.250471 1.556307
H  5.444273 2.925016 0.988738
H  -1.507195 -0.897102 1.37932
H  -1.587154 0.854556 1.664177
H  -2.514863 -0.568512 -0.924606
H  -2.594983 1.182299 -0.638834
H  3.102441 -3.842554 0.923011
H  3.211699 -2.332486 1.881048
H  4.53167 -2.785249 0.759828
H  2.691895 -3.701599 -1.644281
H  2.508644 -2.097616 -2.427059
H  4.111057 -2.635897 -1.834714
H  -4.148371 0.792137 1.325327
H  -4.066023 -0.959473 1.044718
H  -5.07328 -0.638639 -1.259633
H  -5.155041 1.113184 -0.979945
H  -6.711136 0.727974 0.984616
H  -6.627467 -1.024298 0.708726
H  -7.71362 1.042044 -1.320886
H  -7.62859 -0.708901 -1.596816
H  -9.218968 -1.099469 0.355349
H  -9.959189 -0.035255 -0.875143
H  -9.30332 0.662206 0.634181
