program: Gaussian 09
title: 000052892
version: EM64L-G09RevD.01
frameworkgroup: C1[X(C17H34N2O)]
method: RPBEPBE
basis: SDD
operation: Freq
keyword: #p
keyword: freq=noraman
keyword: PBEPBE/SDD
title: #p freq=noraman PBEPBE/SDD
converged: YES YES NO NO
title: Mulliken charges:
elementType: O N N C C C C C C C C C C C C C C C C C H H H H H H H H H H H H H H H H H H H H H H H H H H H H H H H H H H
charge: -0.461993 -0.181559 -0.131831 0.221432 -0.440896 0.163561 -0.482112 -0.396382 -0.387212 -0.734612 -0.729126 -0.361614 -0.019218 -0.387750 -0.380114 -0.373405 -0.698720 -0.352954 -0.356808 -0.696466 0.259064 0.214535 0.238993 0.192480 0.229295 0.203619 0.227138 0.193074 0.227194 0.221347 0.196630 0.230329 0.196271 0.223035 0.184451 0.198314 0.198767 0.198916 0.191918 0.193882 0.190034 0.191558 0.188801 0.214660 0.212409 0.231171 0.186635 0.188387 0.195728 0.194327 0.340520 0.209137 0.215211 0.209947
chargesum: 0.00000
title: Mulliken charges with hydrogens summed into heavy atoms:
elementType: O N N C C C C C C C C C C C C C C C C C
charge: -0.121473 -0.181559 -0.131831 0.221432 0.032703 0.163561 -0.050639 0.036532 0.033000 -0.089440 -0.079491 0.021151 0.179549 0.003083 0.003802 0.006954 -0.040481 0.022068 0.033248 -0.062171
polarizability: 2.46566643e+02 -1.32145576e+01 2.02574507e+02 2.15090812e+00 3.70555256e-01 1.65246029e+02
1716.lowfreq: -8.4752 -0.0004 0.0005 0.0008 4.7072 6.3767 17.2835 25.7625 31.2250
frequency: 16.8963 25.2990 31.1935 35.1730 40.7823 46.7074 59.0986 67.7573 74.7319 89.6324 100.3002 115.9399 135.6694 141.6183 148.5217 151.6350 208.0792 214.1417 218.0356 228.8470 237.9407 250.1216 275.8697 278.2857 290.9851 308.2001 314.1542 337.0827 351.3155 367.1081 434.5516 440.3466 448.4590 465.1001 474.2025 494.5364 586.4327 636.1808 705.5515 718.7634 721.7485 731.2249 753.8871 776.1444 792.0311 803.9267 818.3737 852.2961 885.4489 888.6859 891.6124 907.5000 919.1705 944.1571 949.1232 969.2731 989.3529 989.5519 1009.0673 1013.4491 1018.4493 1037.3304 1052.0556 1062.4749 1068.9189 1079.9275 1081.3352 1082.3660 1093.0762 1117.7018 1120.5493 1152.1268 1174.9403 1181.7748 1195.1181 1207.4611 1213.2831 1217.3801 1239.5272 1244.3890 1245.8708 1248.6094 1270.1450 1278.9098 1280.7055 1284.7588 1290.3719 1293.5014 1295.6420 1300.5302 1308.7983 1315.7628 1335.6620 1345.7169 1349.1947 1355.7767 1356.5058 1366.2322 1372.2094 1382.5974 1386.7919 1390.5168 1415.9840 1445.4143 1451.8476 1459.6914 1460.4242 1462.5573 1464.0992 1464.8161 1467.9940 1468.3580 1468.7585 1472.5897 1474.3121 1477.1174 1480.5297 1481.8176 1485.9583 1489.1883 1500.4709 1577.5346 2948.7666 2949.3787 2950.0001 2950.9838 2955.1155 2961.2861 2967.9349 2968.8949 2971.4527 2972.0504 2974.5858 2975.2456 2979.4602 2980.6325 2982.4640 2988.0098 2991.6120 2996.2742 3009.8329 3023.2149 3034.1087 3035.4901 3041.7414 3050.8398 3067.5133 3067.5732 3068.1913 3070.4216 3071.7924 3074.4393 3083.5731 3085.2472 3090.0680 3555.7407
redmass: 4.0793 3.6769 2.5393 1.7414 3.7672 3.2751 3.3814 3.3562 1.6924 2.9400 3.6483 1.7710 2.4113 2.9618 1.9613 3.9587 1.0759 1.2380 2.6780 1.1249 2.1259 1.4334 1.8125 1.5167 2.4290 1.8145 2.8167 2.5836 2.6388 2.9531 2.3363 2.8803 2.9198 2.3816 3.0077 3.4437 3.7768 4.7888 5.7823 1.0635 1.0866 1.1467 1.4105 2.1902 3.0478 3.3409 1.4915 2.0076 1.3994 1.9045 1.7635 1.9462 1.6591 1.3129 1.2833 1.6773 3.9155 4.4881 1.4338 1.2794 2.2976 3.2077 3.0993 1.7600 2.5625 2.1383 2.2897 2.0284 1.8635 2.0190 2.6435 1.4009 1.9539 1.9091 1.9291 1.2927 1.6331 1.5318 1.7970 1.7089 1.8603 1.4070 1.2819 1.2316 1.0935 1.1154 1.4432 1.1491 1.1199 1.4927 1.3801 1.4636 1.4625 1.2965 1.5091 1.6732 1.6189 1.2223 1.5123 1.2348 1.2192 1.2177 1.7575 1.3368 1.0514 1.0766 1.0731 1.0756 1.0655 1.0499 1.0776 1.0632 1.0602 1.0658 1.0805 1.0425 1.0848 1.0603 1.0907 1.0938 1.1156 8.8713 1.0588 1.0837 1.0586 1.0590 1.0595 1.0593 1.0607 1.0602 1.0371 1.0363 1.0461 1.0368 1.0475 1.0687 1.0934 1.0959 1.0597 1.0993 1.1019 1.1026 1.1024 1.1052 1.1032 1.1029 1.1006 1.0988 1.0995 1.0993 1.0979 1.0989 1.0998 1.1002 1.0993 1.0662
irintensity: 0.4304 0.0704 0.2632 0.0948 0.1767 0.6538 1.0504 1.5052 0.1754 0.2330 0.7555 0.0453 0.3672 0.8348 0.1633 1.1753 0.0457 0.3764 0.2733 0.0022 0.3117 0.6300 35.0113 45.1346 2.2022 57.1461 2.7364 9.0419 2.3256 4.4064 23.2487 1.4603 4.2261 6.0100 0.0732 6.2354 0.5440 8.5100 3.4042 13.9796 1.6690 1.0722 2.5123 0.7364 1.9507 24.4109 0.1259 9.3823 0.5770 4.9531 4.3123 12.6044 0.5196 1.5228 0.8424 6.6801 3.6224 0.5054 1.1552 1.2795 20.3342 2.5658 1.8520 37.6271 5.9787 1.1321 0.5464 40.1877 14.5347 0.8676 15.2056 3.5441 8.8765 7.5170 31.8491 17.4971 24.0234 7.3664 10.5303 5.8034 11.8836 5.3556 20.9939 2.7564 0.0788 0.5300 1.1426 9.7370 0.6901 64.1611 9.0948 24.4066 6.1147 1.8653 0.1875 0.1832 0.6353 22.4483 2.2469 11.4607 24.2872 11.2646 40.7436 46.6107 3.0789 0.6524 0.1500 1.3874 0.2972 3.3011 3.2936 6.7130 4.5739 7.0929 3.7782 11.8311 2.7274 23.4302 3.6834 33.2745 10.8086 176.3542 3.3559 39.7725 0.2755 3.3289 0.1070 49.3815 15.9678 157.3897 34.4784 27.1895 15.8318 22.0245 78.5093 37.0328 11.6218 6.2073 54.0804 2.4915 1.7762 0.8319 10.0729 18.6385 178.6599 19.1124 101.3952 32.0388 25.6563 54.6557 43.1221 58.8582 34.3820 12.5118 49.6269 3.5645
temp: 298.150 k
press: 1.00000 atm
elementType: 8 7 7 6 6 6 6 6 6 6 6 6 6 6 6 6 6 6 6 6 1 1 1 1 1 1 1 1 1 1 1 1 1 1 1 1 1 1 1 1 1 1 1 1 1 1 1 1 1 1 1 1 1 1
symmnumber: 1
zpe: 1269415.3 jmol-1
zpe.correction: 0.483495 hartree
zpe.thermalcorrener: 0.509201 hartree
zpe.thermalcorrenthalpy: 0.510145 hartree
zpe.thermalcorrgfe: 0.424306 hartree
zpe.sumelectzpe: -851.275052 hartree
zpe.sumelectthermal: -851.249345 hartree
zpe.sumelectthermalent: -851.248401 hartree
zpe.sumelectthermalfe: -851.334240 hartree
dipole: -0.6991 4.0604 0.3440
dipole: 4.1345
quadrupole: -128.4145 -122.4189 -127.9578
quadrupole: 11.8467 -0.4463 -6.1496
quadrupole: -2.1508 3.8448 -1.6941 11.8467 -0.4463 -6.1496
hfenergy: -851.7585463 hartree
pointgroup: C01 [X(C17H34N2O1)]
dipole: -0.2868166 -1.5949724 -0.1404739 debye
polarizability: 246.7699261|12.8873502|202.3755442|-1.9730807|0.5165496|165.2417089 unknown
InChI: InChI=1S/C17H34N2O/c1-5-6-7-8-9-10-11-12-16-18-17(3,4)14-19(16)13-15(2)20/h15,20H,5-14H2,1-4H3
charge 0 multiplicity 1
54 atoms
O  4.562723 -2.630761 -0.082344
N  2.832792 -0.19988 -0.504342
N  2.833502 1.725683 0.776633
C  4.076296 1.799362 -0.093659
C  4.145298 0.411978 -0.842903
C  2.212207 0.599452 0.474179
C  0.877457 0.220033 1.074166
C  2.51171 -1.590819 -0.812176
C  -0.320048 0.51419 0.12937
C  5.308974 2.034927 0.803041
C  3.889808 2.969457 -1.088981
C  -1.674752 0.121159 0.758218
C  3.102328 -2.640183 0.161561
C  -2.88644 0.455931 -0.140302
C  -4.237015 0.022025 0.4728
C  -5.455591 0.382587 -0.406438
C  2.513312 -4.042693 -0.073797
C  -6.802143 -0.07876 0.195263
C  -8.023464 0.293777 -0.676001
C  -9.362782 -0.181664 -0.072471
H  4.971701 -0.226003 -0.479437
H  4.250099 0.534043 -1.938384
H  0.762088 0.810828 1.999176
H  0.864024 -0.850526 1.362549
H  2.887151 -1.829895 -1.825766
H  1.413056 -1.716992 -0.831626
H  -0.316274 1.594583 -0.113593
H  -0.18857 -0.022578 -0.832544
H  5.190268 2.975631 1.369348
H  5.423561 1.210973 1.529784
H  6.232696 2.100701 0.196862
H  3.713508 3.909656 -0.537593
H  4.786935 3.092314 -1.725624
H  3.016765 2.786861 -1.741724
H  -1.675055 -0.966765 0.983188
H  -1.788545 0.63922 1.733324
H  2.898465 -2.313877 1.205302
H  -2.905228 1.548223 -0.336061
H  -2.758718 -0.033904 -1.128643
H  -4.354413 0.493484 1.471157
H  -4.223681 -1.074486 0.647889
H  -5.481277 1.481355 -0.563425
H  -5.329477 -0.071226 -1.412048
H  1.422652 -4.052862 0.109819
H  2.972024 -4.786595 0.604864
H  2.697708 -4.36921 -1.113391
H  -6.780821 -1.179244 0.342156
H  -6.925397 0.3660 1.205228
H  -8.048795 1.393943 -0.815334
H  -7.895901 -0.14396 -1.687339
H  4.999198 -3.276836 0.528971
H  -9.374623 -1.281619 0.047967
H  -10.219398 0.09734 -0.713459
H  -9.5282 0.265419 0.926188
