program: Gaussian 09
title: 000052841
version: EM64L-G09RevD.01
frameworkgroup: C1[X(C12H15NO2)]
method: RPBEPBE
basis: SDD
operation: Freq
keyword: #p
keyword: freq=noraman
keyword: PBEPBE/SDD
title: #p freq=noraman PBEPBE/SDD
converged: NO YES NO NO
title: Mulliken charges:
elementType: O O N C C C C C C C C C C C C H H H H H H H H H H H H H H H
charge: -0.240693 -0.215805 -0.059210 0.172224 -0.405130 -0.378504 -0.725627 -0.215332 -0.338490 0.415073 -0.378003 -0.375971 -0.228607 -0.222587 -0.232452 0.247180 0.204776 0.190465 0.259446 0.198493 0.228989 0.239729 0.237343 0.187357 0.252427 0.230284 0.271070 0.227176 0.226151 0.228230
chargesum: 0.00000
title: Mulliken charges with hydrogens summed into heavy atoms:
elementType: O O N C C C C C C C C C C C C
charge: -0.240693 -0.215805 -0.059210 0.172224 0.046825 0.071407 -0.058416 0.209368 -0.086063 0.415073 -0.147719 -0.104902 -0.001431 0.003564 -0.004222
polarizability: 2.09657817e+02 1.14580795e+01 1.39202019e+02 -4.15729558e+00 9.53534211e+00 8.98577171e+01
1716.lowfreq: -5.9035 -0.0008 0.0006 0.0006 6.0270 14.1542 29.7356 56.4052 84.4630
frequency: 29.6526 56.3943 84.4414 108.9021 145.4988 203.1809 211.6420 231.4798 270.4302 281.1497 300.8061 358.6163 405.8483 411.3324 418.7035 443.9733 474.4436 530.2270 541.5459 606.9831 615.4411 631.4373 700.4621 770.5586 787.9882 839.8834 852.8789 858.4238 878.4845 883.2567 891.1865 931.2090 956.7821 974.9692 981.3802 986.4811 988.8271 1001.3995 1014.3793 1021.7526 1050.8485 1078.8565 1111.8794 1132.4372 1170.4853 1176.3310 1179.0383 1181.3999 1225.6552 1235.1210 1276.8338 1283.8770 1312.3440 1327.7606 1351.6659 1374.2916 1381.4178 1388.8615 1401.7891 1438.3064 1440.1574 1445.3100 1452.7905 1462.9265 1476.4555 1481.4042 1582.3552 1608.1612 1619.2187 2891.8921 2939.7615 2948.1104 2985.4549 3004.9029 3074.7884 3082.2442 3095.8144 3102.2432 3117.5315 3126.7670 3131.4816 3140.6005 3155.1369 3165.6426
redmass: 3.8426 4.9288 4.3458 4.6473 3.8101 1.7623 1.5405 3.5617 2.8789 2.4183 2.9681 4.0878 2.8189 2.3560 3.6953 2.6452 3.7461 4.6291 3.8981 5.5516 6.3245 4.6049 1.7773 1.7423 4.5129 3.8840 3.7834 1.2499 4.3750 2.0812 3.3216 1.3842 7.2570 1.6274 1.6826 1.3789 6.2267 1.3614 1.5204 2.1184 3.3973 1.5580 1.9871 3.7328 1.0786 1.4569 1.1358 2.0011 1.9133 2.3382 1.1506 1.3074 1.4050 1.1948 1.2894 2.0959 1.3327 1.2002 2.2362 1.2557 1.5669 1.1340 1.0992 1.0547 1.0664 2.3140 6.5217 6.0217 6.6637 1.0687 1.0671 1.0676 1.0358 1.0885 1.0964 1.0991 1.0992 1.0961 1.0868 1.0871 1.0961 1.0921 1.0957 1.1006
irintensity: 0.9573 2.5473 1.5231 3.4078 2.8451 0.7838 0.4569 2.4121 9.8312 0.1241 0.8654 5.6641 0.2253 14.2646 0.5536 0.6849 29.5412 9.1246 1.9718 8.2476 0.5438 9.1429 48.6228 48.2410 13.3555 26.4675 27.7514 0.0415 14.6336 36.3885 13.4742 1.2920 69.2189 3.7332 20.5302 0.4519 0.1014 1.6207 13.9606 7.1004 99.6954 7.5698 41.1257 19.7889 2.8877 3.9705 5.6365 6.2099 2.1118 37.2085 0.7137 24.1404 6.2684 0.3122 3.6780 3.6225 0.9657 18.6188 10.5867 7.5683 19.7755 5.6482 10.6240 14.2048 14.6168 4.0444 24.3839 20.6529 39.4423 123.1225 21.1574 136.4793 44.7578 11.8201 4.6568 51.4584 10.2872 25.1757 5.9720 0.8747 19.7259 24.2612 24.6770 26.7697
temp: 298.150 k
press: 1.00000 atm
elementType: 8 8 7 6 6 6 6 6 6 6 6 6 6 6 6 1 1 1 1 1 1 1 1 1 1 1 1 1 1 1
symmnumber: 1
zpe: 647734.7 jmol-1
zpe.correction: 0.246709 hartree
zpe.thermalcorrener: 0.260262 hartree
zpe.thermalcorrenthalpy: 0.261206 hartree
zpe.thermalcorrgfe: 0.205948 hartree
zpe.sumelectzpe: -670.310468 hartree
zpe.sumelectthermal: -670.296915 hartree
zpe.sumelectthermalent: -670.295971 hartree
zpe.sumelectthermalfe: -670.351229 hartree
dipole: 1.3990 0.7004 -0.9553
dipole: 1.8331
quadrupole: -71.4884 -85.3987 -94.1223
quadrupole: 3.8358 -1.6538 1.7355
quadrupole: 12.1814 -1.7289 -10.4525 3.8358 -1.6538 1.7355
hfenergy: -670.5571766 hartree
pointgroup: C01 [X(C12H15N1O2)]
dipole: 0.5050122 0.506668 0.0916197 debye
polarizability: 207.2113058|20.4826076|93.3482471|5.52929|11.1517823|138.1580001 unknown
InChI: InChI=1S/C12H15NO2/c1-12(8-14-10-15-9-12)13-7-11-5-3-2-4-6-11/h2-7H,8-10H2,1H3
charge 0 multiplicity 1
30 atoms
O  2.359509 0.494327 -1.866688
O  2.615688 -1.37087 -0.357074
N  0.487238 0.559783 0.75792
C  1.938814 0.845873 0.613481
C  2.389813 1.461948 -0.747441
C  2.714642 -0.492549 0.820488
C  2.308768 1.825237 1.751144
C  3.140933 -0.685529 -1.527032
C  -0.26753 0.31739 -0.281771
C  -1.710807 0.021799 -0.134953
C  -2.482212 -0.250471 -1.296524
C  -2.345209 0.004806 1.138127
C  -3.86163 -0.534081 -1.192033
C  -3.721238 -0.276776 1.241344
C  -4.484741 -0.547057 0.077258
H  1.711554 2.277699 -1.049482
H  3.421246 1.865909 -0.645131
H  3.784839 -0.268319 1.028803
H  2.279097 -1.058324 1.658114
H  3.395231 2.028532 1.780571
H  1.774213 2.783448 1.621689
H  1.996076 1.40057 2.720291
H  3.050135 -1.380026 -2.372595
H  4.200835 -0.386197 -1.339206
H  0.120476 0.311583 -1.318439
H  -1.995165 -0.241451 -2.279972
H  -1.734696 0.215898 2.0222
H  -4.447961 -0.744375 -2.093436
H  -4.205662 -0.287402 2.224406
H  -5.555358 -0.765978 0.161141
