program: Gaussian 09
title: 000052839
version: EM64L-G09RevD.01
frameworkgroup: C1[X(C10H12ClNO2)]
method: RPBEPBE
basis: SDD
operation: Freq
keyword: #p
keyword: freq=noraman
keyword: PBEPBE/SDD
title: #p freq=noraman PBEPBE/SDD
converged: YES YES NO NO
title: Mulliken charges:
elementType: Cl O O N C C C C C C C C C C H H H H H H H H H H H H
charge: -0.066371 -0.247788 -0.249261 -0.587062 -0.128095 -0.036423 -0.328768 -0.323978 0.364675 -0.377247 -0.376645 -0.207552 -0.208093 -0.098711 0.255656 0.187795 0.232686 0.171132 0.172910 0.253055 0.285144 0.266741 0.269753 0.267267 0.254667 0.254514
chargesum: 0.00000
title: Mulliken charges with hydrogens summed into heavy atoms:
elementType: Cl O O N C C C C C C C C C C
charge: -0.066371 -0.247788 -0.249261 -0.035177 0.127561 0.151372 0.075051 0.101986 0.364675 -0.107494 -0.109378 0.047114 0.046421 -0.098711
polarizability: 1.97247232e+02 -4.93968582e-01 1.17075288e+02 -5.94090434e+00 -2.98816014e-01 7.23573226e+01
1716.lowfreq: -10.8279 -4.7001 -0.0015 -0.0011 -0.0008 7.4112 33.6396 43.9199 95.0392
frequency: 33.5741 43.9021 95.0297 107.4593 198.9662 215.5625 236.7301 239.6993 257.2536 310.3173 315.1348 398.3776 409.1151 412.5423 436.9856 469.8323 474.0222 498.3286 530.5853 604.1620 623.0363 680.9095 712.7759 804.2600 835.3749 856.3103 887.0427 890.1908 908.1364 908.4711 950.5036 967.1241 977.4465 997.9106 1012.0806 1044.9607 1070.5684 1107.7280 1114.0012 1135.8187 1160.8535 1179.8190 1185.9278 1213.7036 1261.5912 1290.2442 1309.5239 1312.8667 1327.6204 1339.7750 1353.3723 1377.4732 1379.2560 1389.0560 1447.9149 1460.2971 1478.3543 1589.6907 1605.2649 1636.6648 2848.1656 2915.3709 2928.0814 3043.1840 3085.5984 3113.3498 3160.2163 3160.5647 3177.5988 3181.6319 3488.0761 3622.6317
redmass: 3.8179 6.7518 6.5376 5.5733 4.0541 1.3905 3.2227 5.1211 3.0116 2.9014 5.3647 4.4395 2.9351 5.0462 2.0131 3.3861 3.7291 1.6689 4.6884 6.9039 7.1186 4.2715 4.6961 1.7586 1.2477 2.6608 1.7620 2.6222 3.1679 4.2121 8.8769 1.4298 1.3628 3.5958 2.0418 4.0175 2.6403 1.3287 2.9975 3.3608 1.4961 1.1087 1.1379 1.8949 1.2630 1.2420 1.2120 1.2157 1.3185 1.2597 1.7558 5.5031 1.4604 3.2803 1.0830 1.0990 2.6169 8.0147 6.3112 1.0980 1.0805 1.0687 1.0694 1.0855 1.0953 1.0951 1.0885 1.0886 1.0965 1.0976 1.0450 1.0991
irintensity: 0.5150 0.5302 0.7666 0.4480 0.2241 40.2870 7.1245 4.5107 13.2240 10.9203 7.0419 4.9550 0.0521 13.5093 5.2600 24.2992 36.7683 238.3642 15.3736 15.0934 1.4067 8.2157 11.2295 83.5237 0.5718 3.6274 33.9280 17.3072 35.9787 10.1457 48.9715 0.4053 0.0395 119.8185 2.1883 213.0003 25.1372 3.1379 1.8722 9.8583 9.9351 5.1701 2.9263 4.6402 29.4129 0.2528 1.0276 2.6220 24.9022 0.4138 81.6732 0.6996 0.2562 9.7627 6.3464 13.8014 59.4950 3.4045 18.3806 50.6427 64.1333 37.4106 108.0288 20.3573 32.8405 20.9714 0.8641 1.3547 5.9258 0.7254 2.5065 4.6258
temp: 298.150 k
press: 1.00000 atm
elementType: 17 8 8 7 6 6 6 6 6 6 6 6 6 6 1 1 1 1 1 1 1 1 1 1 1 1
symmnumber: 1
zpe: 537099.2 jmol-1
zpe.correction: 0.204570 hartree
zpe.thermalcorrener: 0.217564 hartree
zpe.thermalcorrenthalpy: 0.218508 hartree
zpe.thermalcorrgfe: 0.164227 hartree
zpe.sumelectzpe: -1052.443378 hartree
zpe.sumelectthermal: -1052.430385 hartree
zpe.sumelectthermalent: -1052.429441 hartree
zpe.sumelectthermalfe: -1052.483722 hartree
dipole: -4.9631 1.0616 1.6735
dipole: 5.3442
quadrupole: -82.3252 -85.5422 -89.4517
quadrupole: -6.7719 -2.4941 -0.7790
quadrupole: 3.4479 0.2308 -3.6787 -6.7719 -2.4941 -0.7790
hfenergy: -1052.6479485 hartree
pointgroup: C01 [X(C10H12Cl1N1O2)]
dipole: -1.9342865 0.5272557 0.633474 debye
dipolederiv: -0.9312538 0.0294657 0.0838445 0.0298214 -0.135389 0.0015822 0.0940155 0.0012496 -0.0892436 -1.1472124 0.2107156 -0.0768642 0.1798613 -0.6580548 0.0187992 -0.2121988 0.0980015 -0.4348193 -1.090156 -0.2176703 -0.0376906 -0.199886 -0.6413726 0.0304686 -0.1703562 -0.0413576 -0.4234025 -0.8982404 -0.1482878 -0.0381504 -0.2863167 -0.6864811 -0.0687794 -0.0426373 -0.0462989 -0.1850452 0.5157882 0.0444693 0.0191452 -0.002077 0.1880965 0.0540758 0.0486744 0.0387877 0.1377457 1.0889409 0.0026972 0.0695893 0.0069148 0.9237132 -0.0260922 0.416486 -0.0340195 0.6794156 0.7049905 -0.1497318 -0.0073634 -0.0818748 0.2026192 0.0160707 -0.0955749 0.0570382 0.3525768 0.7500099 0.1149418 -0.0312445 0.0245843 0.187854 -0.002028 -0.0981127 -0.0450992 0.3750687 0.0061679 -0.0056592 -0.0420901 -0.0113729 -0.0936873 0.004854 -0.0935335 0.0045605 -0.0588703 0.0059685 0.0627208 -0.017312 -0.0571546 0.0426618 -0.0137337 0.0206991 0.0014108 -0.1191966 0.0070892 -0.0632423 -0.0065683 0.0611647 0.0420416 -0.0126113 0.0105659 -0.0290296 -0.1178906 -0.3614623 -0.080603 0.0264032 -0.079114 -0.0009013 -0.0006908 0.0300823 0.0034302 -0.1175755 -0.3521105 0.102226 0.0103495 0.1035008 -0.016212 -0.0190448 0.0132377 -0.0234542 -0.1140406 1.3046783 -0.0440198 -0.1397466 -0.0454442 0.1463117 -0.0125597 -0.1489978 -0.0122631 -0.0473864 0.0386055 -0.0012086 0.0179466 -0.0130325 0.0414003 -0.0127365 0.0071194 -0.0154138 -0.1232482 -0.1500919 0.0158867 0.1250339 0.0032358 -0.04554 -0.0207173 -0.0354094 -0.0163004 -0.2126038 -0.0089496 0.0657967 -0.0273888 0.0723818 -0.0766238 0.0680069 -0.0518436 0.1030863 0.0336453 -0.0744942 0.0297152 0.0304334 -0.0411051 0.0568628 0.0088323 0.1098021 -0.096661 -0.2021571 -0.0727006 -0.0154871 0.0257286 0.0672271 0.0672774 -0.0583579 0.1006315 0.0366192 -0.2036867 0.0060176 -0.0607989 -0.0139057 -0.0659384 -0.0753514 -0.0376285 -0.0276743 -0.0649077 0.0706524 0.1587728 0.0696779 0.0113971 0.2187807 0.236171 0.1248035 0.0284168 0.075209 0.1498072 0.2056457 0.0406038 -0.0343375 0.1158541 0.2979019 -0.0937785 0.0286983 -0.045797 0.0333837 0.1059197 -0.0663993 0.0202275 -0.0740351 0.0108278 0.0205707 0.0269621 0.0125326 0.145712 0.1105062 0.0650549 0.0088674 0.0745067 -0.0017643 0.002439 0.0150553 0.0103757 0.1469589 0.0426313 0.0690664 0.005706 0.0680785 -0.0111904 0.0066051 0.0069282 0.0058809 0.1634536 0.0349395 -0.0699299 0.0179898 -0.0685607 -0.0011711 0.0216506 0.0189638 0.0224197 0.1607462 unknown
polarizability: 197.0298518|-3.1870152|116.7580906|-7.0088619|-4.1788384|72.8919011 unknown
InChI: InChI=1S/C10H12ClNO2/c11-8-3-1-7(2-4-8)10-13-5-9(12)6-14-10/h1-4,9-10H,5-6,12H2
charge 0 multiplicity 1
26 atoms
Cl 5.313373 -0.127298 -0.291814
O  -1.322375 1.269995 -0.264571
O  -1.385258 -1.140537 -0.030321
N  -4.950423 0.076394 -0.19293
C  -3.512714 0.07415 -0.487284
C  -0.785528 0.105343 0.441958
C  -2.780573 1.368392 -0.034743
C  -2.845057 -1.135878 0.205976
C  0.711406 0.045052 0.221728
C  1.382828 -1.200593 0.243769
C  1.451566 1.236725 0.036514
C  2.785235 -1.261356 0.085757
C  2.854485 1.191526 -0.123011
C  3.497779 -0.060147 -0.091639
H  -3.373695 -0.041181 -1.577099
H  -1.046304 0.21887 1.526386
H  -3.114359 2.248399 -0.607778
H  -2.976565 1.540478 1.050357
H  -3.045852 -1.101294 1.302291
H  -3.225425 -2.083052 -0.202617
H  -5.549923 0.543183 -0.87478
H  -5.207976 0.268473 0.778416
H  0.802654 -2.119481 0.36502
H  0.924667 2.194237 -0.001412
H  3.309741 -2.220983 0.097333
H  3.431592 2.108482 -0.271505
