program: Gaussian 09
title: 000052837
version: EM64L-G09RevD.01
frameworkgroup: C1[X(C11H16N2O)]
method: RPBEPBE
basis: SDD
operation: Freq
keyword: #p
keyword: freq=noraman
keyword: PBEPBE/SDD
title: #p freq=noraman PBEPBE/SDD
converged: YES YES NO NO
title: Mulliken charges:
elementType: O N N C C C C C C C C C C C H H H H H H H H H H H H H H H H
charge: -0.263911 -0.146056 -0.364417 0.322956 0.049524 -0.350104 -0.357761 0.343066 -0.371100 -0.368663 -0.642402 -0.654561 -0.243420 -0.684983 0.272438 0.249022 0.248874 0.242681 0.222545 0.266224 0.221185 0.226713 0.249256 0.220974 0.206139 0.208711 0.206170 0.233347 0.231870 0.225681
chargesum: 0.00000
title: Mulliken charges with hydrogens summed into heavy atoms:
elementType: O N N C C C C C C C C C C C
charge: -0.263911 -0.146056 -0.138736 0.322956 0.049524 -0.077665 -0.108738 0.343066 -0.122226 -0.125981 0.067552 0.042383 0.171430 -0.013597
polarizability: 2.14290452e+02 -5.33823744e+00 1.33845910e+02 2.47503854e+00 5.72212054e+00 8.54927574e+01
1716.lowfreq: -5.5455 -0.0005 0.0001 0.0006 1.9726 13.1706 44.1851 63.0278 83.2414
frequency: 44.1555 63.0203 83.2348 96.4682 121.6920 124.7895 151.2563 209.1872 215.8449 231.9793 245.4355 254.4688 290.7141 333.8934 365.9689 397.7564 421.4067 444.5412 481.3013 532.5834 584.8342 625.3937 661.6297 686.7551 749.9632 775.8039 804.8501 813.4394 835.4286 850.9228 873.6298 902.8224 958.2175 976.7221 1002.4264 1034.9204 1041.6254 1052.7093 1093.7196 1112.5864 1118.8371 1131.5954 1135.9263 1140.1119 1178.1249 1218.6828 1225.3145 1254.8890 1261.2344 1299.0739 1359.3101 1362.2383 1378.4649 1400.5940 1420.7676 1424.8424 1447.3485 1460.9981 1468.7368 1473.5856 1477.5223 1483.0581 1486.7151 1493.5924 1506.0710 1559.0910 1583.9155 1620.5293 2918.4949 2935.6057 2953.4713 2997.4811 3011.6267 3017.5581 3032.8966 3086.1841 3094.6092 3106.8151 3120.8625 3135.3790 3153.2566 3163.2714 3174.0120 3338.3312
redmass: 3.5930 3.4943 3.1684 3.0302 1.9939 2.8008 2.0379 2.8951 1.2022 1.8566 1.2538 4.5098 2.8772 3.7779 2.9833 2.8082 3.0038 4.7875 3.4821 3.0416 4.5003 6.5614 3.2270 4.7512 4.2593 4.5016 1.3825 1.2132 1.1419 1.6054 3.1924 3.2919 1.3371 1.3591 2.8244 2.5497 2.0205 1.4625 1.2377 1.6282 1.6405 1.4674 1.4343 1.5078 1.2629 3.3417 4.0983 2.7983 1.1444 1.2812 3.1510 1.6336 2.8045 1.2897 3.6488 1.1648 1.2445 1.0398 1.0521 1.0729 1.0837 1.0563 1.2419 1.1764 1.7439 5.5878 6.9939 6.3899 1.0495 1.0462 1.0554 1.0362 1.1075 1.0926 1.0814 1.1011 1.0989 1.1013 1.0948 1.0881 1.0880 1.0945 1.0972 1.0748
irintensity: 1.4103 0.6019 0.4837 1.0174 1.2458 4.7747 1.8358 0.9591 0.1866 2.2643 1.1688 2.1252 4.8844 7.8110 3.3034 2.0604 0.3749 2.5427 16.2328 11.1811 32.8718 0.6705 12.1238 1.5989 5.9097 0.9053 33.8096 52.7943 0.4230 78.6883 26.1709 42.4487 3.3410 3.6124 19.6133 114.0133 40.8344 11.5369 4.3193 8.0887 17.9635 32.8449 4.5556 92.6083 89.9003 114.7795 149.3030 28.5661 0.0405 4.5364 93.9710 76.8639 34.3751 31.9273 16.2609 12.7423 44.6081 11.7525 22.1259 32.4939 24.5683 5.9392 54.4999 24.2497 29.2196 62.3231 48.5005 132.3681 72.0393 123.5462 39.5960 27.7827 37.6104 42.8823 30.5855 19.9040 29.4503 34.6530 15.5573 9.3243 2.6266 16.7310 4.8170 29.4876
temp: 298.150 k
press: 1.00000 atm
elementType: 8 7 7 6 6 6 6 6 6 6 6 6 6 6 1 1 1 1 1 1 1 1 1 1 1 1 1 1 1 1
symmnumber: 1
zpe: 658897.9 jmol-1
zpe.correction: 0.250961 hartree
zpe.thermalcorrener: 0.265696 hartree
zpe.thermalcorrenthalpy: 0.266640 hartree
zpe.thermalcorrgfe: 0.209210 hartree
zpe.sumelectzpe: -612.402021 hartree
zpe.sumelectthermal: -612.387286 hartree
zpe.sumelectthermalent: -612.386341 hartree
zpe.sumelectthermalfe: -612.443772 hartree
dipole: -0.2636 -4.4474 0.6819
dipole: 4.5071
quadrupole: -62.7539 -84.8797 -86.6041
quadrupole: 1.8653 -4.1789 3.4306
quadrupole: 15.3253 -6.8005 -8.5248 1.8653 -4.1789 3.4306
hfenergy: -612.6529818 hartree
pointgroup: C01 [X(C11H16N2O1)]
dipole: 0.0986775 -1.6486022 0.6455667 debye
polarizability: 214.3156502|5.7313446|116.7000279|-0.2772632|-23.8055084|102.6134414 unknown
InChI: InChI=1S/C11H16N2O/c1-4-14-10-7-5-9(6-8-10)11(12)13(2)3/h5-8,12H,4H2,1-3H3
charge 0 multiplicity 1
30 atoms
O  -3.309108 0.119235 -0.447812
N  3.164359 -0.692561 0.245864
N  2.917688 1.603964 -0.537011
C  0.926526 0.273231 -0.255472
C  2.417133 0.421896 -0.216575
C  0.18343 0.992403 -1.230433
C  0.218894 -0.503386 0.6947
C  -1.912686 0.125933 -0.320262
C  -1.217648 0.918924 -1.270152
C  -1.190939 -0.583249 0.673482
C  2.838517 -2.073711 -0.16355
C  4.575523 -0.48206 0.598047
C  -4.089219 -0.673586 0.522769
C  -5.559451 -0.506493 0.147997
H  0.73347 1.622082 -1.936222
H  0.774637 -1.025424 1.481819
H  -1.797614 1.466667 -2.019174
H  -1.706706 -1.179764 1.431508
H  3.502304 -2.411158 -0.989127
H  1.799934 -2.131604 -0.51876
H  2.960569 -2.774696 0.684295
H  4.923618 -1.337211 1.203343
H  4.684062 0.435036 1.203255
H  5.242081 -0.399447 -0.290245
H  -3.777712 -1.737268 0.466612
H  -3.890163 -0.300554 1.548717
H  -6.197067 -1.081313 0.844165
H  -5.855021 0.555283 0.197355
H  -5.743003 -0.870118 -0.877363
H  3.957496 1.62925 -0.544573
