program: Gaussian 09
title: 000052846
version: EM64L-G09RevD.01
frameworkgroup: C1[X(C12H11Cl5O2S)]
method: RPBEPBE
basis: SDD
operation: Freq
keyword: #p
keyword: freq=noraman
keyword: PBEPBE/SDD
title: #p freq=noraman PBEPBE/SDD
converged: YES YES NO NO
title: Mulliken charges:
elementType: Cl Cl Cl Cl Cl S O O C C C C C C C C C C C C H H H H H H H H H H H
charge: 0.054184 0.034028 0.058664 0.061327 0.066022 0.338378 -0.299451 -0.277746 0.016907 0.373580 -0.338261 -0.722734 -0.685771 -0.689553 -0.181643 -0.145239 -0.040388 -0.072249 -0.055681 -0.080480 0.241543 0.194933 0.235243 0.289369 0.271840 0.233944 0.218130 0.226047 0.229775 0.218115 0.227169
chargesum: 0.00000
title: Mulliken charges with hydrogens summed into heavy atoms:
elementType: Cl Cl Cl Cl Cl S O O C C C C C C C C C C C C
charge: 0.054184 0.034028 0.058664 0.061327 0.066022 0.338378 -0.299451 -0.277746 0.258449 0.373580 0.091915 -0.161524 -0.007651 -0.014494 -0.181643 -0.145239 -0.040388 -0.072249 -0.055681 -0.080480
polarizability: 2.96606638e+02 1.95166205e+00 2.20959861e+02 -1.53867842e+01 -2.01174824e+00 1.17416172e+02
1716.lowfreq: -0.0014 -0.0014 -0.0013 1.0566 3.3377 7.2709 15.9456 24.0753 28.0554
frequency: 15.7495 23.8272 27.8490 44.3226 57.9323 62.1294 77.8448 91.6318 107.7022 165.6729 177.5917 181.4265 206.7226 207.1736 213.7716 216.3189 221.6171 228.2923 279.8205 304.6548 307.7779 316.3521 323.0361 324.5786 339.5924 352.8453 375.6391 391.9499 439.0126 471.7710 580.5705 586.8910 593.9156 601.9446 612.2848 625.9162 633.3064 680.0151 718.9569 748.0408 760.7920 812.3631 816.9067 850.6544 890.8615 921.5347 936.3344 982.6333 986.7021 1015.6757 1022.8896 1055.5296 1103.1010 1136.5364 1162.6623 1172.7639 1199.6321 1219.5020 1242.4123 1244.4684 1295.1910 1297.7850 1305.7104 1321.5007 1322.5496 1354.9882 1378.6993 1390.6207 1422.8918 1449.8957 1451.0318 1468.1505 1469.5944 1471.3464 1504.4396 1519.5604 2965.3756 2996.2721 2998.0951 3001.5505 3044.9784 3091.8134 3099.3954 3104.3948 3107.8935 3109.2835 3127.2037
redmass: 5.5755 7.1562 6.4632 4.6150 6.2885 27.3107 18.7541 5.4666 4.7911 8.8923 1.1244 5.3108 28.8948 10.4695 24.1257 1.4844 11.1964 2.0876 6.6952 3.6235 11.9296 6.6907 8.2453 4.3978 8.7548 17.2607 19.4342 2.9656 2.3697 3.3217 3.8850 10.2049 11.7050 6.7453 5.1678 14.2744 13.1124 6.8544 6.0423 2.9488 11.5474 12.8892 12.0072 3.7448 1.8447 1.4717 2.3825 1.4810 3.2840 2.6194 11.2095 2.1648 2.2308 1.9253 1.2553 11.0123 1.3095 2.4496 1.7723 1.8411 1.7499 5.3110 5.3313 1.2446 8.6575 1.4645 1.2936 1.2242 1.1141 1.0476 1.0508 1.0698 1.0597 1.0696 11.9877 11.8915 1.0682 1.0723 1.0451 1.0361 1.0570 1.0984 1.1002 1.1005 1.0999 1.1005 1.1078
irintensity: 0.2087 0.2820 0.4857 3.2521 0.9085 0.1056 0.0277 2.1584 4.7108 0.9543 0.0362 0.1616 0.0198 0.4223 0.0777 0.9743 0.1001 0.3722 1.1630 0.0476 0.1158 0.3218 0.4777 0.1376 1.0134 1.0329 3.3998 2.2266 10.2965 14.8435 5.4311 0.4774 0.3903 1.5031 4.7745 59.3276 54.1215 25.7173 12.2125 39.2963 1.9535 1.0935 5.7505 34.7783 11.2977 0.9339 1.3978 5.5283 41.7712 122.2912 13.2405 4.6589 20.4514 48.8913 47.2834 2.5530 10.7862 145.0841 41.7396 11.4080 74.3722 155.3853 104.0754 5.1222 20.9416 2.7876 47.7054 26.6226 8.0351 0.6787 3.6842 0.8026 19.4512 4.7012 0.0557 3.1305 51.7585 8.5097 29.8025 11.1865 11.6882 18.7225 0.2514 17.9758 32.3135 39.8920 6.9150
temp: 298.150 k
press: 1.00000 atm
elementType: 17 17 17 17 17 16 8 8 6 6 6 6 6 6 6 6 6 6 6 6 1 1 1 1 1 1 1 1 1 1 1
symmnumber: 1
zpe: 535571.8 jmol-1
zpe.correction: 0.203989 hartree
zpe.thermalcorrener: 0.225930 hartree
zpe.thermalcorrenthalpy: 0.226875 hartree
zpe.thermalcorrgfe: 0.149149 hartree
zpe.sumelectzpe: -3311.137669 hartree
zpe.sumelectthermal: -3311.115727 hartree
zpe.sumelectthermalent: -3311.114783 hartree
zpe.sumelectthermalfe: -3311.192509 hartree
dipole: 1.2572 -0.5284 1.4945
dipole: 2.0232
quadrupole: -159.2739 -161.4559 -157.0799
quadrupole: 2.9452 -0.1426 1.3072
quadrupole: -0.0040 -2.1860 2.1900 2.9452 -0.1426 1.3072
hfenergy: -3311.3416572 hartree
pointgroup: C01 [X(C12H11Cl5O2S1)]
dipole: -0.4958996 -0.1740826 -0.5978215 debye
polarizability: 296.3479013|0.8386647|220.0985596|-17.0942263|9.2847832|118.5362109 unknown
InChI: InChI=1S/C12H11Cl5O2S/c1-12(2)18-3-5(19-12)4-20-11-9(16)7(14)6(13)8(15)10(11)17/h5H,3-4H2,1-2H3
charge 0 multiplicity 1
31 atoms
Cl 1.798322 3.145778 0.52392
Cl 0.61366 -2.313218 0.522163
Cl 3.656759 -2.959297 -0.206333
Cl 4.851601 2.468013 -0.126395
Cl 5.782188 -0.576971 -0.511139
S  -0.396414 0.789959 0.92465
O  -3.485918 0.51738 0.356927
O  -4.821108 -0.928815 -0.975568
C  -2.600137 -0.458699 -0.323159
C  -4.897417 0.102666 0.106015
C  -3.459844 -0.880203 -1.53621
C  -1.301945 0.251603 -0.675592
C  -5.496902 -0.574283 1.339934
C  -5.659213 1.339057 -0.375603
C  1.332471 0.390198 0.463346
C  2.297755 1.425771 0.330322
C  1.779782 -0.949105 0.304105
C  3.126303 -1.252712 -0.00046
C  3.653019 1.137595 0.040319
C  4.066578 -0.203854 -0.131332
H  -2.408766 -1.325028 0.340943
H  -3.38882 -0.133379 -2.35432
H  -3.229155 -1.887103 -1.918436
H  -1.496603 1.166773 -1.25663
H  -0.624573 -0.419777 -1.226171
H  -4.842635 -1.39341 1.681611
H  -5.611232 0.156677 2.158496
H  -6.487501 -0.994828 1.094689
H  -5.228682 1.708207 -1.321419
H  -6.721787 1.091146 -0.539766
H  -5.592187 2.142558 0.37819
