program: Gaussian 09
title: 000052888
version: EM64L-G09RevD.01
frameworkgroup: C1[X(C19H38N2)]
method: RPBEPBE
basis: SDD
operation: Freq
keyword: #pfreq=noraman
keyword: PBEPBE/SDD
title: #p freq=noraman PBEPBE/SDD
converged: YES YES NO NO
title: Mulliken charges:
elementType: N N C C C C C C C C C C C C C C C C C C C H H H H H H H H H H H H H H H H H H H H H H H H H H H H H H H H H H H H H H
charge: -0.188263 -0.126230 0.212429 -0.448646 0.180008 -0.053725 -0.507323 -0.380369 -0.729245 -0.735718 -0.361779 -0.389082 -0.384528 -0.686653 -0.704303 -0.385090 -0.381996 -0.372853 -0.353423 -0.356598 -0.696761 0.212505 0.221466 0.218030 0.204567 0.240358 0.223962 0.192483 0.233794 0.226257 0.196594 0.196279 0.219958 0.230360 0.186924 0.198615 0.192354 0.198114 0.195645 0.192405 0.216397 0.213085 0.226260 0.229890 0.215264 0.220182 0.192294 0.194507 0.191119 0.192884 0.188801 0.189935 0.188153 0.187109 0.194429 0.194991 0.209830 0.209461 0.214885
chargesum: 0.00000
title: Mulliken charges with hydrogens summed into heavy atoms:
elementType: N N C C C C C C C C C C C C C C C C C C C
charge: -0.188263 -0.126230 0.212429 -0.014675 0.180008 0.164305 -0.062398 0.036075 -0.072600 -0.089122 0.023760 0.001385 0.003523 -0.030911 -0.038967 0.001711 0.002008 0.005884 0.021840 0.032822 -0.062585
polarizability: 2.73845178e+02 -1.05707673e+01 2.09348288e+02 4.59804226e+00 2.54365879e-01 1.85991500e+02
1716.lowfreq: -8.5737 -0.0017 -0.0008 0.0019 3.2606 6.8585 12.3019 21.1574 28.6397
frequency: 11.1152 20.5506 28.4272 34.4226 48.9104 51.9697 58.4048 68.9675 71.6963 99.3485 105.5948 113.2536 120.1125 135.8111 141.8129 150.4245 158.4805 177.4159 183.0163 211.4991 212.3319 228.3814 239.2818 247.4203 253.8704 275.0904 276.4600 313.1720 328.3203 350.1942 368.6337 398.0617 404.2716 439.0202 464.8568 479.3452 496.5139 509.6263 557.4605 613.6454 691.9516 718.2734 720.2651 725.2035 735.7215 743.0668 765.6087 795.1064 809.9187 846.9273 864.1768 873.9209 888.1690 909.8081 919.7484 920.9119 933.9111 944.1719 966.6425 975.8295 978.8273 992.2804 1011.0421 1013.6542 1020.3302 1025.3657 1036.8359 1060.5261 1068.0010 1072.0189 1078.8774 1080.5426 1083.3824 1096.9360 1122.7604 1127.6183 1146.1600 1169.6760 1179.8379 1185.0415 1198.5558 1202.6346 1209.0342 1230.1292 1232.8326 1234.6584 1245.2534 1256.9931 1261.7462 1274.6306 1277.8776 1285.2466 1287.5133 1289.9680 1294.6605 1296.5930 1302.1014 1305.9532 1317.0609 1333.8690 1343.6994 1349.8235 1353.6128 1356.6288 1357.2030 1366.3812 1372.8787 1381.1215 1388.2539 1392.0857 1402.0282 1452.0143 1458.6673 1459.1025 1460.4642 1461.8176 1462.7597 1463.9381 1465.6311 1466.7617 1468.3976 1469.3822 1471.9440 1475.3453 1476.3224 1477.3337 1482.1657 1482.3619 1485.6276 1486.4424 1488.2295 1495.5059 1575.5319 2937.5906 2948.2801 2948.6492 2950.1146 2951.0310 2952.9014 2957.4916 2962.7073 2967.7075 2970.7919 2972.4260 2972.9833 2977.5498 2978.0558 2980.4457 2981.4792 2983.3107 2984.7923 2989.8581 2997.0807 3005.4290 3006.9616 3018.1820 3028.6318 3029.2332 3037.1641 3043.0118 3067.3120 3068.0451 3069.6135 3072.0137 3073.5313 3074.3334 3079.6154 3083.0855 3086.8421 3090.2463 3091.5142
redmass: 3.1920 2.6836 2.5578 2.7314 3.2544 2.5759 2.6809 2.7170 1.9536 3.2549 2.1156 2.2390 3.5949 2.1965 2.4398 2.1466 2.0160 3.0839 2.5673 1.1019 1.0769 1.1259 2.5833 1.0583 1.2431 2.2690 2.9939 2.5911 2.4884 2.3537 2.8685 3.0242 2.8873 2.7007 3.2900 2.9938 3.1745 2.9929 2.7298 4.0531 5.0630 1.0582 1.0694 1.1043 1.4971 1.8898 1.2618 2.9960 1.4722 1.7530 2.1899 1.7157 1.8976 1.2331 1.4349 1.4937 1.3879 1.3875 1.4895 1.7519 2.5383 4.4047 1.5398 3.1287 1.6334 1.6307 2.9576 2.8354 2.8652 2.1832 2.3554 2.0872 2.3158 1.4206 2.8083 2.2233 1.4483 2.0168 1.9742 2.1517 1.7650 1.3139 1.7245 2.3517 1.4441 1.7346 2.5297 1.3468 1.3021 1.2212 1.0451 1.0703 1.2218 1.2136 1.1094 1.1341 1.5612 1.3910 1.4065 1.3944 1.4590 1.5365 1.6970 1.6270 1.6509 1.2224 1.2111 1.2947 1.2176 1.2377 2.1046 1.0517 1.0778 1.0747 1.0621 1.0654 1.0737 1.0666 1.0520 1.0818 1.0583 1.0557 1.0835 1.0465 1.0432 1.0848 1.0637 1.0888 1.0644 1.0891 1.0939 1.0932 8.6766 1.0663 1.0588 1.0587 1.0593 1.0593 1.0596 1.0594 1.0588 1.0583 1.0368 1.0586 1.0374 1.0357 1.0360 1.0676 1.0951 1.0359 1.0964 1.0981 1.1005 1.0842 1.1024 1.1036 1.1036 1.0963 1.1033 1.1036 1.1007 1.0997 1.0993 1.0976 1.0998 1.0990 1.1004 1.0988 1.1000 1.1002 1.0991
irintensity: 0.2202 0.0213 0.1644 0.1324 0.1631 0.1470 0.2231 0.2418 0.0999 0.3699 0.1061 0.0478 0.1640 0.2150 1.0171 0.0456 0.0520 0.5873 0.2192 0.0979 0.0446 0.0008 0.1225 0.3133 0.2341 0.4418 0.1698 1.2230 2.8699 1.1257 0.1867 0.5570 4.3002 3.1688 1.6166 1.8782 4.1962 5.5514 4.6229 6.1989 2.2666 18.3272 0.0834 3.0421 3.7133 1.0094 0.4469 3.8575 1.1074 6.0310 4.5824 3.1954 4.9945 1.3404 0.7715 0.7416 0.3185 3.0460 3.5554 1.3902 0.7553 0.2307 0.4235 2.5217 2.4691 6.3693 6.2285 2.3869 1.6746 3.9056 0.9429 0.0354 1.0366 14.0747 15.3582 14.4495 3.6072 14.3546 9.0248 13.1139 20.6527 14.3627 3.8627 60.0452 5.1225 32.1494 7.4152 8.3225 1.9061 9.9760 0.5862 0.1255 10.2446 0.2156 0.9495 1.7048 49.9080 7.0048 6.1461 1.2482 8.6131 3.6959 0.7786 0.2627 0.6670 20.0819 32.0558 14.1991 11.1611 7.3583 98.4833 3.0919 2.1737 0.1265 3.9123 1.0557 0.1054 1.7731 3.6864 0.7869 4.8431 0.8114 1.7237 17.7378 11.8737 3.2513 19.1771 4.1245 2.9936 4.3273 40.4620 8.8213 154.3376 55.6705 0.2485 0.2613 0.6575 0.4612 4.7316 0.4367 85.2662 168.6341 36.5006 21.3352 40.3898 38.5381 28.1785 47.6819 4.8640 23.9666 3.2723 2.5656 1.2092 17.4580 0.8964 1.8967 1.7755 32.6523 15.5965 247.7283 97.8336 21.2064 55.5123 44.6051 6.1568 50.8071 30.7389 86.7169 9.5884 43.2438 41.0681
temp: 298.150 k
press: 1.00000 atm
elementType: 7 7 6 6 6 6 6 6 6 6 6 6 6 6 6 6 6 6 6 6 6 1 1 1 1 1 1 1 1 1 1 1 1 1 1 1 1 1 1 1 1 1 1 1 1 1 1 1 1 1 1 1 1 1 1 1 1 1 1
symmnumber: 1
zpe: 1405749.9 jmol-1
zpe.correction: 0.535422 hartree
zpe.thermalcorrener: 0.562644 hartree
zpe.thermalcorrenthalpy: 0.563588 hartree
zpe.thermalcorrgfe: 0.474216 hartree
zpe.sumelectzpe: -854.588492 hartree
zpe.sumelectthermal: -854.561270 hartree
zpe.sumelectthermalent: -854.560326 hartree
zpe.sumelectthermalfe: -854.649698 hartree
dipole: -0.1859 3.0257 0.8530
dipole: 3.1491
quadrupole: -133.6860 -135.1941 -136.5250
quadrupole: 12.1850 5.2238 -2.3430
quadrupole: 1.4490 -0.0591 -1.3900 12.1850 5.2238 -2.3430
hfenergy: -855.1239143 hartree
pointgroup: C01 [X(C19H38N2)]
dipole: -0.059706 -1.1572918 -0.4383279 debye
polarizability: 273.5971922|11.6559757|209.3802081|-3.6058069|2.2517705|186.2075648 unknown
InChI: InChI=1S/C19H38N2/c1-6-7-8-9-10-11-12-13-14-15-18-20-19(4,5)16-21(18)17(2)3/h17H,6-16H2,1-5H3
charge 0 multiplicity 1
59 atoms
N  4.089709 -0.563435 -0.297106
N  4.175115 1.517478 0.720747
C  5.394962 1.431777 -0.175419
C  5.448319 -0.070975 -0.64628
C  3.510437 0.383914 0.577276
C  3.752515 -2.004497 -0.324016
C  2.169832 0.146571 1.232179
C  0.977101 0.273689 0.244422
C  5.161004 2.379457 -1.378129
C  6.650995 1.846742 0.613919
C  -0.387483 0.099799 0.946451
C  -1.587996 0.210052 -0.020459
C  -2.954386 0.049632 0.683375
C  4.479607 -2.807623 0.789473
C  4.027825 -2.60377 -1.720801
C  -4.156929 0.143621 -0.282672
C  -5.522618 -0.011539 0.423587
C  -6.725943 0.072201 -0.542662
C  -8.091645 -0.083591 0.163515
C  -9.294438 -0.004177 -0.804528
C  -10.65476 -0.164534 -0.091856
H  6.232086 -0.637386 -0.097964
H  5.647625 -0.15955 -1.729284
H  2.663508 -2.073087 -0.139567
H  2.137797 -0.847294 1.722296
H  2.066975 0.907443 2.024983
H  1.026052 1.268686 -0.239637
H  1.074033 -0.474893 -0.567973
H  4.964094 3.403108 -1.014785
H  4.284957 2.050761 -1.966669
H  6.04549 2.401774 -2.04329
H  7.557374 1.781996 -0.017877
H  6.788135 1.197455 1.49701
H  6.54489 2.886317 0.970507
H  -0.418163 -0.886696 1.455988
H  -0.487257 0.864712 1.744385
H  -1.491686 -0.560201 -0.814348
H  -1.553694 1.192547 -0.535776
H  -3.054477 0.826967 1.469607
H  -2.983501 -0.928156 1.208883
H  4.139404 -3.859531 0.792623
H  5.573707 -2.808753 0.631503
H  4.276015 -2.374414 1.785477
H  3.501574 -2.028751 -2.502926
H  3.682991 -3.652795 -1.762291
H  5.1088 -2.596089 -1.95231
H  -4.058926 -0.636746 -1.066421
H  -4.126493 1.1194 -0.811433
H  -5.550147 -0.984385 0.958191
H  -5.623354 0.772865 1.20282
H  -6.624994 -0.712517 -1.321743
H  -6.698983 1.044895 -1.07749
H  -8.195858 0.702541 0.940648
H  -8.119193 -1.055225 0.700348
H  -9.187514 -0.788388 -1.581858
H  -9.267557 0.96761 -1.338889
H  -10.797362 0.623924 0.67131
H  -10.719986 -1.142377 0.421975
H  -11.497389 -0.100857 -0.804938
