program: Gaussian 09
title: 000002234
version: EM64L-G09RevD.01
frameworkgroup: C1[X(C6H15N5O)]
method: RPBEPBE
basis: SDD
operation: Freq
keyword: #p
keyword: freq=noraman
keyword: PBEPBE/SDD
title: #p freq=noraman PBEPBE/SDD
converged: YES YES NO NO
title: Mulliken charges:
elementType: O N N N N N C C C C C C H H H H H H H H H H H H H H H
charge: -0.261708 -0.547331 -0.106156 -0.610935 -0.634204 -0.659365 -0.367809 -0.396741 -0.241471 -0.453905 0.191131 0.208215 0.210263 0.251127 0.225801 0.164581 0.202008 0.190531 0.198913 0.281603 0.262182 0.327529 0.311615 0.320949 0.290415 0.308843 0.333921
chargesum: 0.00000
title: Mulliken charges with hydrogens summed into heavy atoms:
elementType: O N N N N N C C C C C C
charge: -0.261708 -0.003546 -0.106156 0.028209 -0.022840 -0.016601 0.093581 -0.006359 -0.039463 -0.064461 0.191131 0.208215
polarizability: 1.27691487e+02 5.34300701e+00 1.01624270e+02 2.50675101e+00 6.23387059e+00 8.95179068e+01
1716.lowfreq: -9.1381 -0.0011 -0.0008 -0.0006 4.3301 14.2394 23.4961 32.8272 37.7297
frequency: 22.4008 32.7555 37.6708 63.8503 104.0592 157.9511 183.7959 192.1756 227.5018 254.9327 281.7876 295.1764 352.4983 365.7584 395.5341 424.3865 446.2758 468.6257 491.3199 499.0993 555.1074 575.3929 592.9007 609.5452 678.7388 722.9569 733.3684 771.4634 788.5337 868.1912 897.5749 961.9024 995.9354 1018.0739 1030.3789 1047.3248 1076.8783 1080.8632 1124.5091 1154.5139 1180.7661 1188.0763 1236.8790 1258.2225 1275.8663 1305.0665 1329.0055 1346.1839 1359.7006 1370.5201 1406.8427 1455.3655 1456.6260 1474.2515 1592.5989 1601.4955 1613.0471 1638.2189 1653.7127 1671.8676 2867.0556 2911.4004 2961.5347 2978.4097 2992.6227 3034.6634 3065.2741 3407.5289 3507.7795 3519.2543 3526.0016 3551.4389 3664.5928 3666.9212 3697.8384
redmass: 4.4737 4.2027 5.8913 4.1696 3.8928 2.3639 3.0518 3.6284 1.5175 2.6177 1.9675 2.3904 2.9073 1.2127 1.2718 1.1850 1.9073 2.8595 2.3249 1.2108 2.5611 1.3643 1.2945 3.1919 4.7309 2.4374 2.3823 1.8297 1.8172 2.7361 1.7590 2.9072 2.1811 2.0088 1.4424 1.8506 1.8403 2.2833 2.5261 1.4962 1.9240 1.3683 1.5085 1.4777 1.2281 1.2640 1.9309 1.4376 1.4396 1.5805 4.3261 1.0882 1.0837 1.0906 1.4604 1.2203 1.2800 3.2235 1.1034 3.6573 1.0547 1.1016 1.0648 1.0841 1.0610 1.0950 1.1033 1.0453 1.0445 1.0450 1.0946 1.0453 1.1039 1.1016 1.1028
irintensity: 3.5744 2.5960 10.4149 6.1089 0.7578 2.7904 3.6860 1.5067 46.6807 4.9084 23.2889 20.2278 9.0843 95.5136 201.6187 123.6798 18.3864 20.8674 4.4960 191.9056 107.0514 145.9495 111.3197 8.2023 87.9208 14.9484 76.4675 98.5199 58.8679 8.1502 11.8819 16.9920 6.8762 1.6819 10.1186 3.4683 8.7136 2.1108 9.7636 6.2705 3.3095 5.9140 23.8415 47.3966 5.2425 7.4640 38.0593 43.2862 21.3698 13.7333 123.1543 23.4491 2.6311 15.8180 59.4400 143.7374 71.4852 221.0040 67.4707 554.4386 79.8782 59.3541 57.3317 52.0089 23.7809 17.9107 40.9508 2.2463 19.6086 18.6928 1.8512 17.5362 16.5457 19.5944 19.1539
temp: 298.150 k
press: 1.00000 atm
elementType: 8 7 7 7 7 7 6 6 6 6 6 6 1 1 1 1 1 1 1 1 1 1 1 1 1 1 1
symmnumber: 1
zpe: 600216.3 jmol-1
zpe.correction: 0.228610 hartree
zpe.thermalcorrener: 0.243262 hartree
zpe.thermalcorrenthalpy: 0.244206 hartree
zpe.thermalcorrgfe: 0.185479 hartree
zpe.sumelectzpe: -585.655163 hartree
zpe.sumelectthermal: -585.640512 hartree
zpe.sumelectthermalent: -585.639568 hartree
zpe.sumelectthermalfe: -585.698295 hartree
dipole: 3.1988 -2.9991 -2.4770
dipole: 5.0361
quadrupole: -49.1640 -73.0142 -70.6108
quadrupole: 6.2273 9.0263 6.3969
quadrupole: 15.0990 -8.7512 -6.3478 6.2273 9.0263 6.3969
hfenergy: -585.8837737 hartree
pointgroup: C01 [X(C6H15N5O1)]
dipole: 1.1805805 0.6264963 1.4627109 debye
polarizability: 127.9873294|-4.819666|94.6885399|-2.4671719|8.4207867|96.1577941 unknown
InChI: InChI=1S/C6H15N5O/c7-4(5(8)12)2-1-3-11-6(9)10/h4H,1-3,7-10H2
charge 0 multiplicity 1
27 atoms
O  -2.888813 -1.488103 -0.920287
N  -2.904027 1.281553 -1.771988
N  1.905926 -0.090809 -0.030605
N  -3.201142 -0.757649 1.260639
N  3.730829 -1.369688 -0.776695
N  4.190467 0.530103 0.526685
C  -0.849544 0.989583 -0.435351
C  -0.18468 0.778039 0.940074
C  -2.397185 0.885972 -0.440811
C  1.348854 0.945722 0.861625
C  -2.843713 -0.554843 -0.063554
C  3.204634 -0.268452 -0.079566
H  -0.603582 1.99822 -0.82079
H  -0.425607 0.253991 -1.14491
H  -0.398772 -0.238695 1.319789
H  -0.588549 1.508415 1.674402
H  -2.803222 1.601514 0.303617
H  1.567174 1.972561 0.479827
H  1.775636 0.885416 1.892535
H  -2.587216 0.609136 -2.485231
H  -3.930417 1.347953 -1.796969
H  -3.471062 -1.69452 1.562103
H  -3.140878 -0.01179 1.951571
H  3.02593 -1.98849 -1.175865
H  4.603609 -1.260098 -1.292144
H  5.105591 0.142665 0.744938
H  3.918162 1.400093 0.97436
