program: Gaussian 09
title: 000052847
version: EM64L-G09RevD.01
frameworkgroup: C1[X(C16H24O2)]
method: RPBEPBE
basis: SDD
operation: Freq
keyword: #pfreq=noraman
keyword: PBEPBE/SDD
title: #p freq=noraman PBEPBE/SDD
converged: YES YES NO NO
title: Mulliken charges:
elementType: O O C C C C C C C C C C C C C C C C H H H H H H H H H H H H H H H H H H H H H H H H
charge: -0.296990 -0.262056 -0.059641 -0.007363 -0.602177 -0.013027 -0.339827 -0.727089 0.505419 -0.691757 -0.448910 -0.391838 0.541998 -0.231334 -0.409043 -0.472131 -0.694765 -0.693001 0.238787 0.197429 0.199028 0.246530 0.222317 0.195572 0.234818 0.193500 0.236041 0.246551 0.221148 0.239446 0.208787 0.227394 0.232764 0.206008 0.224885 0.227793 0.209906 0.210081 0.227140 0.227260 0.209705 0.210641
chargesum: 0.00000
title: Mulliken charges with hydrogens summed into heavy atoms:
elementType: O O C C C C C C C C C C C C C C C C
charge: -0.296990 -0.262056 0.179146 0.190066 -0.156619 0.209290 0.090563 -0.050996 0.505419 -0.022376 -0.221516 -0.159074 0.541998 -0.025326 -0.184158 -0.244338 -0.047638 -0.045395
polarizability: 2.48101640e+02 -6.71411996e+00 1.45964091e+02 1.93540728e+00 1.31698755e+01 1.45075254e+02
1716.lowfreq: -15.5171 -2.4626 -0.0009 -0.0008 -0.0007 4.1951 12.9796 21.9628 29.8213
frequency: 12.4898 20.6395 28.6825 42.2747 50.5865 72.9902 95.1237 126.1427 165.8620 182.1150 205.1287 208.8823 227.0725 231.9815 243.7163 256.9668 284.1290 296.9413 340.1580 369.1776 387.5338 403.8257 407.9477 449.6439 454.5164 506.7342 537.2720 581.8960 597.1580 638.2171 671.5077 701.5983 750.5798 795.5797 808.3812 835.1151 851.5005 864.0318 879.1388 889.2821 890.6720 901.3674 911.2565 917.0153 936.6474 953.6555 958.0066 972.3346 973.1109 1012.4950 1024.1275 1045.7402 1058.3970 1068.2258 1105.0207 1114.3175 1119.0815 1129.3618 1133.7450 1154.6193 1170.5234 1191.3519 1191.6513 1208.5726 1219.2759 1223.2066 1261.2055 1265.5758 1293.3047 1303.7603 1307.7366 1308.9553 1315.1566 1322.3335 1340.9763 1354.5876 1373.3504 1376.0164 1383.1193 1388.4378 1390.9929 1394.4387 1413.0913 1459.7881 1465.2629 1467.1939 1467.9279 1474.2341 1475.2312 1477.0595 1477.5603 1483.4000 1484.2019 1507.0223 1581.2903 1622.7715 2916.0307 2961.3054 2971.9709 2974.8455 2976.1994 2977.2996 2978.9535 2985.4245 2997.9212 3007.9658 3044.3733 3064.3170 3071.6292 3072.3835 3076.0743 3080.4714 3080.7899 3097.6752 3098.0801 3103.7981 3106.3417 3109.4059 3129.3244 3136.6437
redmass: 3.3675 3.1257 3.8770 3.7267 3.4975 3.6318 3.8086 3.7269 2.9265 1.9607 1.2063 1.1826 1.5041 1.6282 1.3011 2.2348 2.9271 2.7600 2.8030 2.5883 2.7227 2.8426 2.8644 3.1486 2.9438 3.2150 2.8854 2.5962 3.4439 6.7681 7.1720 3.3064 3.5091 3.6995 3.4777 1.9487 1.2525 2.3175 2.3131 2.5086 2.7036 1.5159 3.0804 1.1856 1.4742 1.4676 1.3618 2.2871 1.5502 2.9904 3.5119 1.5787 2.3643 1.6363 2.5366 2.5533 1.6026 2.0222 1.9450 1.7469 2.0534 1.2038 1.1396 1.3839 2.8903 1.7830 1.1942 1.1785 1.6269 1.2965 1.1748 1.3192 1.4950 1.4172 1.3866 1.4369 1.5209 1.1961 3.0568 1.3470 1.2635 1.2544 2.4154 1.0533 1.0470 1.0489 1.0830 1.0545 1.0801 1.0488 1.0533 1.1022 1.0776 2.4035 6.3963 6.4677 1.0841 1.0688 1.0348 1.0372 1.0425 1.0821 1.0581 1.0367 1.0854 1.0821 1.1002 1.1000 1.0992 1.0960 1.1005 1.0996 1.0983 1.1002 1.0991 1.0988 1.0866 1.0866 1.0958 1.0965
irintensity: 1.6162 0.3943 0.9525 0.5180 0.0149 0.7110 0.0589 0.4595 1.6375 1.8708 0.5763 1.6518 0.3659 0.2282 0.8573 2.6450 0.4130 2.0260 1.3822 1.5358 2.0672 2.1438 0.0485 6.8911 3.3054 5.7946 11.6745 22.9017 0.3006 0.0860 6.3449 0.3610 1.2288 19.4393 1.8416 32.0729 0.8177 55.9021 3.6669 2.0357 33.5657 17.2696 15.7902 2.8291 3.6593 0.0118 0.2888 4.7085 2.1894 11.8272 162.4759 28.9024 77.3034 0.2774 20.7860 2.0401 25.2351 6.9455 4.9498 0.7787 7.1388 9.9776 2.4147 7.1212 2.0451 2.1694 1.6803 2.1229 8.2856 3.9744 12.5276 0.9646 1.5460 8.5065 3.3778 5.6125 17.1511 15.8460 11.1418 32.8826 11.1258 11.8237 5.2984 8.0625 5.1519 0.6989 7.6141 3.3571 7.6647 15.5137 8.0925 4.8794 20.3218 41.4891 0.0385 0.4089 59.4971 68.9704 31.9988 41.3177 21.7243 20.8509 24.9039 31.0086 37.5808 22.0947 15.6349 1.1474 108.8711 37.8888 26.2331 42.5633 26.9972 26.6559 20.8780 37.4854 12.7815 23.3070 45.6056 3.7784
temp: 298.150 k
press: 1.00000 atm
elementType: 8 8 6 6 6 6 6 6 6 6 6 6 6 6 6 6 6 6 1 1 1 1 1 1 1 1 1 1 1 1 1 1 1 1 1 1 1 1 1 1 1 1
symmnumber: 1
zpe: 952894.4 jmol-1
zpe.correction: 0.362938 hartree
zpe.thermalcorrener: 0.382444 hartree
zpe.thermalcorrenthalpy: 0.383388 hartree
zpe.thermalcorrgfe: 0.312043 hartree
zpe.sumelectzpe: -773.141919 hartree
zpe.sumelectthermal: -773.122414 hartree
zpe.sumelectthermalent: -773.121470 hartree
zpe.sumelectthermalfe: -773.192815 hartree
dipole: 1.6388 -0.3688 -0.1103
dipole: 1.6834
quadrupole: -87.2574 -113.7039 -107.4160
quadrupole: -3.7662 -0.0176 6.6545
quadrupole: 15.5350 -10.9115 -4.6236 -3.7662 -0.0176 6.6545
hfenergy: -773.5048578 hartree
pointgroup: C01 [X(C16H24O2)]
dipole: -0.6374582 -0.1793157 -0.0109757 debye
polarizability: 247.3833761|9.7948366|154.9121364|5.0086355|-9.6506973|136.8454727 unknown
InChI: InChI=1S/C16H24O2/c1-11(2)15-7-5-14(6-8-15)9-12(3)16-17-10-13(4)18-16/h5-8,11-13,16H,9-10H2,1-4H3
charge 0 multiplicity 1
42 atoms
O  -3.377473 -0.901381 -0.440751
O  -3.879764 0.780878 1.130914
C  -1.558965 0.607521 0.336498
C  -3.038902 0.48804 -0.034809
C  -0.677928 0.180334 -0.877549
C  -4.665706 -1.277084 0.21776
C  -5.133138 0.047913 0.87254
C  -1.239385 2.039997 0.8177
C  0.795657 0.038389 -0.524961
C  -5.628919 -1.857017 -0.819399
C  1.766383 0.96218 -0.989441
C  1.241014 -1.032291 0.291986
C  3.575694 -0.24598 0.168354
C  5.053478 -0.409509 0.536196
C  3.130317 0.823311 -0.651041
C  2.604584 -1.16989 0.631824
C  5.588095 0.811915 1.330754
C  5.928156 -0.675166 -0.718359
H  -1.385867 -0.105541 1.166108
H  -3.315029 1.163716 -0.877681
H  -0.799733 0.926716 -1.687978
H  -1.069123 -0.782578 -1.256932
H  -4.425641 -2.029072 0.99442
H  -5.783042 0.621564 0.177951
H  -5.63754 -0.084987 1.841631
H  -1.436629 2.778705 0.016052
H  -0.17486 2.121658 1.098205
H  -1.857478 2.30854 1.691032
H  -5.843554 -1.114682 -1.608492
H  -5.190648 -2.749949 -1.296573
H  -6.582029 -2.154698 -0.342269
H  1.447507 1.797676 -1.625567
H  0.512976 -1.768341 0.656511
H  5.135088 -1.298288 1.194702
H  3.853378 1.55541 -1.031633
H  2.923954 -2.009396 1.262799
H  5.542792 1.733356 0.720636
H  6.642695 0.6541 1.625002
H  4.993554 0.984152 2.245962
H  5.575749 -1.56593 -1.268847
H  6.983754 -0.838058 -0.430491
H  5.896128 0.184868 -1.413065
