program: Gaussian 09
title: 000052833
version: EM64L-G09RevD.01
frameworkgroup: C1[X(C14H20Cl2O)]
method: RPBEPBE
basis: SDD
operation: Freq
keyword: #p
keyword: freq=noraman
keyword: PBEPBE/SDD
title: #p freq=noraman PBEPBE/SDD
converged: YES YES NO NO
title: Mulliken charges:
elementType: Cl Cl O C C C C C C C C C C C C C C H H H H H H H H H H H H H H H H H H H H
charge: -0.063499 -0.017720 -0.388050 -0.384431 -0.365173 -0.372283 -0.388964 -0.352812 -0.571112 -0.356594 0.571861 -0.695782 -0.406916 -0.455851 -0.245259 -0.251541 0.442479 0.195187 0.194831 0.193272 0.194749 0.190166 0.190155 0.211834 0.213465 0.188682 0.188397 0.211040 0.212449 0.194937 0.194944 0.210055 0.215701 0.209925 0.263439 0.263669 0.364749
chargesum: 0.00000
title: Mulliken charges with hydrogens summed into heavy atoms:
elementType: Cl Cl O C C C C C C C C C C C C C C
charge: -0.063499 -0.017720 -0.023301 0.005587 0.022849 0.008038 0.036335 0.024266 -0.147623 0.033287 0.571861 -0.060100 -0.143478 -0.192182 -0.245259 -0.251541 0.442479
polarizability: 2.32267935e+02 1.13540632e+00 1.83354120e+02 2.27132528e+01 -1.34652436e-01 1.19192638e+02
1716.lowfreq: -5.2321 -0.0024 0.0011 0.0011 1.8806 5.5281 12.8050 26.8791 31.7589
frequency: 12.5776 26.8622 31.6550 42.1477 75.9237 89.1010 97.2835 101.7287 139.0532 143.6469 151.7620 163.8950 195.9164 199.7819 223.6327 227.6501 265.7294 292.1815 316.2289 351.4227 369.7270 409.9456 430.1030 434.4591 469.2798 490.4576 529.2642 545.7047 624.2788 710.2215 721.1455 727.6658 741.1413 747.8242 770.9947 789.3630 854.3964 867.3712 887.4726 888.1748 907.2063 932.2161 985.1979 1004.9406 1014.4845 1040.6928 1046.8330 1058.0064 1077.5488 1079.9217 1091.1725 1119.3585 1144.0614 1185.7997 1205.3838 1215.0092 1221.1702 1234.3960 1256.0394 1259.2637 1281.2357 1282.6728 1290.2323 1294.4479 1296.4882 1300.4199 1325.2362 1344.4811 1354.3558 1355.5706 1383.9054 1388.4152 1400.4807 1460.9561 1461.6492 1465.4307 1468.2173 1474.1304 1475.8525 1476.9318 1480.6498 1486.6298 1489.2890 1567.9087 1609.3639 2949.4338 2950.7485 2952.9774 2960.0331 2967.3755 2970.5786 2971.6134 2982.1672 2984.0963 2990.6075 3001.7238 3015.1732 3025.6915 3037.8369 3051.2224 3067.9788 3070.8659 3154.9294 3161.0180 3496.5551
redmass: 5.6908 3.8860 1.7737 3.5723 4.4077 1.7147 2.4293 12.2985 1.8726 2.1003 6.5222 4.1896 10.1024 4.8111 3.7170 1.1508 4.2813 4.6503 3.6729 17.2150 4.9519 5.1125 3.1238 1.1109 3.2349 5.4053 4.8157 4.4691 4.5612 4.6412 1.0616 1.0791 4.5406 1.2615 5.2780 1.2022 1.2652 1.5733 1.8781 1.4351 4.9770 1.2382 4.5924 1.1636 4.0542 3.1287 3.2204 2.9570 2.3237 2.1960 1.3065 2.6178 1.4747 1.7739 1.7798 1.2831 1.4490 1.8121 1.3131 1.3271 1.0496 1.2364 1.3705 1.0991 1.2024 1.6905 1.4466 1.4854 1.6295 1.6507 4.2897 1.2172 3.6276 1.0736 1.0736 1.0674 1.0846 1.0837 4.1043 1.0427 1.0870 1.0907 1.0989 6.4142 8.3913 1.0588 1.0588 1.0592 1.0591 1.0590 1.0589 1.0365 1.0598 1.0966 1.0988 1.1013 1.1026 1.1038 1.1046 1.1046 1.1007 1.0992 1.0922 1.0929 1.0648
irintensity: 0.1204 0.0841 0.0285 0.0174 0.0063 0.0132 0.0056 0.0008 0.0143 0.0109 0.1574 0.7830 0.1857 0.4461 1.2919 0.0436 1.5341 7.7056 0.5616 2.4385 0.6869 2.7565 1.4241 140.0448 0.2493 0.0270 15.1457 10.5574 8.1874 8.6784 14.5847 0.0454 58.7398 23.8263 27.7009 0.4558 4.1399 24.1909 5.5434 2.2236 3.4776 0.0124 2.0708 1.2784 4.0829 0.2667 0.0939 0.5042 0.5118 0.3183 8.0920 20.2037 166.6965 0.5869 0.3663 11.9709 5.0319 133.7041 1.2198 3.6041 0.1478 4.6412 4.6173 0.2072 1.0446 6.9685 1.5941 0.4622 1.2220 0.0345 30.9182 11.0807 21.3498 0.0974 0.0216 0.0910 0.6184 1.4947 123.2664 12.3786 1.3164 1.0420 35.8733 44.6249 1.5361 0.7904 2.6605 0.1962 24.8300 95.2077 44.5246 43.1984 79.9776 0.4609 0.5812 0.8050 0.1972 1.2581 73.2455 112.3559 97.5543 55.6320 1.5663 1.5551 69.5259
temp: 298.150 k
press: 1.00000 atm
elementType: 17 17 8 6 6 6 6 6 6 6 6 6 6 6 6 6 6 1 1 1 1 1 1 1 1 1 1 1 1 1 1 1 1 1 1 1 1
symmnumber: 1
zpe: 802774.7 jmol-1
zpe.correction: 0.305761 hartree
zpe.thermalcorrener: 0.325389 hartree
zpe.thermalcorrenthalpy: 0.326333 hartree
zpe.thermalcorrgfe: 0.253839 hartree
zpe.sumelectzpe: -1539.516569 hartree
zpe.sumelectthermal: -1539.496940 hartree
zpe.sumelectthermalent: -1539.495996 hartree
zpe.sumelectthermalfe: -1539.568490 hartree
dipole: 2.6516 -1.7269 0.8334
dipole: 3.2723
quadrupole: -124.9291 -119.3191 -119.0876
quadrupole: 8.9230 1.6548 1.9064
quadrupole: -3.8172 1.7928 2.0243 8.9230 1.6548 1.9064
hfenergy: -1539.8223294 hartree
pointgroup: C01 [X(C14H20Cl2O1)]
dipole: 1.0449839 0.5973625 -0.4567066 debye
polarizability: 231.5141764|-5.9291227|181.4448144|-23.7672457|-10.9199486|121.8557019 unknown
InChI: InChI=1S/C14H20Cl2O/c1-2-3-4-5-6-7-8-11-9-12(15)14(17)13(16)10-11/h9-10,17H,2-8H2,1H3
charge 0 multiplicity 1
37 atoms
Cl -4.708072 2.743689 0.177852
Cl -4.28369 -2.747416 0.892122
O  -5.587757 -0.05563 1.057638
C  3.32916 -0.024304 0.16361
C  2.207455 0.045621 -0.896822
C  4.749274 0.033451 -0.443519
C  0.790734 0.020052 -0.282131
C  5.870906 -0.063968 0.614911
C  -0.331428 0.042825 -1.357068
C  7.291812 0.007386 0.010193
C  -1.72765 0.033535 -0.754148
C  8.405995 -0.09608 1.074066
C  -2.303537 -1.175913 -0.284886
C  -2.467866 1.23347 -0.610202
C  -3.735676 1.196819 -0.010632
C  -3.575682 -1.184505 0.310583
C  -4.332414 0.00346 0.466464
H  3.205699 0.810298 0.885082
H  3.219533 -0.960087 0.750594
H  2.317574 -0.803795 -1.603582
H  2.329469 0.969415 -1.50056
H  4.867624 -0.789934 -1.179005
H  4.865591 0.978579 -1.014432
H  0.673834 -0.886052 0.34629
H  0.661834 0.887372 0.396278
H  5.761719 -1.013865 1.179254
H  5.748954 0.752986 1.356939
H  -0.200761 0.941854 -1.990137
H  -0.201219 -0.83482 -2.020961
H  7.412121 -0.806806 -0.733588
H  7.401524 0.958319 -0.550365
H  8.336096 -1.05053 1.629452
H  9.410898 -0.044699 0.615896
H  8.328169 0.725827 1.810855
H  -1.758803 -2.119784 -0.388529
H  -2.058099 2.184163 -0.964277
H  -5.989621 0.853867 1.088265
