program: Gaussian 09
title: 000052865
version: EM64L-G09RevD.01
frameworkgroup: C1[X(C14H21N3O2S)]
method: RPBEPBE
basis: SDD
operation: Freq
keyword: #p
keyword: freq=noraman
keyword: PBEPBE/SDD
title: #p freq=noraman PBEPBE/SDD
converged: YES YES NO NO
title: Mulliken charges:
elementType: S O O N N N C C C C C C C C C C C C C C H H H H H H H H H H H H H H H H H H H H H
charge: 0.212482 -0.271973 -0.289214 -0.083109 -0.418763 -0.018717 -0.370529 -0.330298 -0.635690 0.319806 -0.001766 -0.190106 -0.486915 -0.480275 -0.622749 -0.614776 0.240039 0.225367 -0.535055 -0.523057 0.230421 0.218035 0.176028 0.210118 0.280379 0.285671 0.309461 0.246212 0.269295 0.185799 0.221126 0.232328 0.226490 0.222069 0.187386 0.224506 0.245653 0.216814 0.228045 0.209064 0.250394
chargesum: 0.00000
title: Mulliken charges with hydrogens summed into heavy atoms:
elementType: S O O N N N C C C C C C C C C C C C C C
charge: 0.212482 -0.271973 -0.289214 -0.083109 -0.109301 -0.018717 0.077927 0.055849 -0.069640 0.319806 -0.001766 -0.190106 -0.240702 -0.210979 0.016504 0.021170 0.240039 0.225367 0.151917 0.164447
polarizability: 3.37556121e+02 -1.26560021e+01 1.94110857e+02 -1.62204433e+00 -2.57712008e+00 1.15692935e+02
1716.lowfreq: -1.4548 -0.0019 0.0007 0.0010 4.1150 4.9397 14.6764 18.8823 32.9653
frequency: 14.5209 18.8017 32.9539 53.3249 65.5851 79.6246 81.3390 101.4920 114.7475 120.7739 125.6639 145.5577 164.4693 199.1774 216.3989 226.6423 230.4708 250.1064 258.9636 271.4336 309.1413 330.7456 333.3016 350.5051 356.1844 404.1760 431.8802 439.3803 449.9175 483.5009 488.8111 539.7775 551.0511 621.0712 645.3147 687.9779 702.9696 719.3870 749.1858 755.2655 756.5087 816.5876 821.5939 843.8438 849.4055 888.8145 929.8794 942.3993 984.4409 1018.5643 1032.6709 1048.9993 1050.5598 1070.1929 1092.3955 1102.5179 1109.9408 1112.4971 1120.5605 1149.5608 1150.8061 1153.2944 1159.5712 1162.8395 1199.8501 1213.1397 1226.4107 1248.0647 1264.6211 1269.6094 1301.7779 1304.5655 1321.6555 1328.7607 1374.2753 1383.1724 1410.6970 1420.0752 1424.4547 1437.1830 1443.0478 1449.2076 1455.5814 1461.6964 1463.9620 1465.5480 1470.1707 1474.5393 1475.4181 1477.2476 1482.0892 1482.2005 1483.8100 1488.4924 1585.2806 1642.6149 2823.6637 2843.2319 2860.4795 2955.4310 2966.8834 2997.0772 3010.5137 3019.5030 3031.5109 3042.4343 3042.5273 3059.8856 3071.5468 3078.4238 3088.6295 3118.7664 3119.9360 3122.8184 3162.5768 3182.2966 3599.8203
redmass: 5.0353 2.5080 5.1131 3.1957 3.2270 2.3215 3.0148 3.4161 3.4137 3.8529 2.3138 3.6351 1.3763 3.6832 2.6354 1.2217 1.8301 1.5178 1.8973 2.8497 4.6634 3.4058 3.4682 3.7380 5.3053 5.1555 2.5539 4.1673 3.8061 3.9970 3.8236 9.1200 1.2653 4.9628 6.1441 6.6708 6.6296 5.9633 2.3220 1.2598 4.0060 1.9662 4.4606 1.2433 4.1713 1.5534 10.2862 6.2745 5.3214 2.5681 1.5180 1.4521 3.5082 2.2511 1.3196 4.2255 1.2698 1.2581 1.2573 1.5575 1.5842 1.7780 1.7526 2.0544 5.9742 1.8359 1.3570 1.4054 2.2408 1.2303 1.1656 7.8355 1.4884 3.3816 1.3802 3.7195 3.9893 1.1426 1.3931 1.3410 1.1580 1.0926 1.0820 1.0544 1.0655 1.0520 2.2404 1.6640 1.0700 1.0560 1.0914 1.0922 1.7738 1.0703 9.0204 7.7468 1.0700 1.0575 1.0577 1.0331 1.0342 1.0616 1.0841 1.0721 1.0719 1.0572 1.1037 1.1036 1.0983 1.1010 1.1000 1.1034 1.1087 1.0992 1.0913 1.0929 1.0813
irintensity: 2.5241 1.3932 0.9103 2.9432 1.1033 1.9785 1.3552 1.4948 1.7649 7.6856 3.1962 1.2759 2.5722 1.9947 0.3305 1.7116 0.0618 2.4140 0.7881 1.0051 8.7052 6.0995 4.7426 5.8077 2.8743 5.7109 2.1679 6.4201 5.7157 2.4845 3.6037 36.3555 96.9995 2.1440 5.0052 22.6199 2.0857 10.6744 1.3887 9.3491 2.8061 42.4164 28.3735 0.7334 11.9012 24.5101 5.5294 39.9273 60.6640 12.8510 17.8022 3.2073 4.9846 36.9975 5.9554 76.3001 19.2300 0.2673 9.0234 31.2123 8.4157 0.2769 178.9939 52.8219 23.3905 7.3907 8.2893 12.2644 1.4287 1.9901 3.3120 5.3361 130.5184 156.1793 31.2166 24.4424 323.5321 2.6686 23.2143 69.4493 0.8306 21.2179 4.8253 8.4767 15.4789 13.5955 90.8156 17.7906 5.4252 12.9151 12.8080 7.9445 0.9426 21.5050 17.6847 21.6103 69.5984 72.6802 224.9749 71.0202 96.1426 7.8899 29.2212 45.9836 44.5843 9.4872 49.0389 24.3857 40.1828 35.9888 48.7122 24.6417 16.7022 25.0381 8.6760 1.3783 45.1648
temp: 298.150 k
press: 1.00000 atm
elementType: 16 8 8 7 7 7 6 6 6 6 6 6 6 6 6 6 6 6 6 6 1 1 1 1 1 1 1 1 1 1 1 1 1 1 1 1 1 1 1 1 1
symmnumber: 1
zpe: 876965.7 jmol-1
zpe.correction: 0.334019 hartree
zpe.thermalcorrener: 0.356215 hartree
zpe.thermalcorrenthalpy: 0.357159 hartree
zpe.thermalcorrgfe: 0.279820 hartree
zpe.sumelectzpe: -1257.264673 hartree
zpe.sumelectthermal: -1257.242476 hartree
zpe.sumelectthermalent: -1257.241532 hartree
zpe.sumelectthermalfe: -1257.318872 hartree
dipole: -0.6608 -3.0881 2.0394
dipole: 3.7593
quadrupole: -100.8669 -116.9160 -130.8586
quadrupole: 21.1877 -3.5044 2.6051
quadrupole: 15.3469 -0.7021 -14.6448 21.1877 -3.5044 2.6051
hfenergy: -1257.5986916 hartree
pointgroup: C01 [X(C14H21N3O2S1)]
dipole: -0.2639368 -1.3262547 0.5991103 debye
polarizability: 337.0669473|-13.6399652|193.1550715|-7.5250354|10.4226718|117.137894 unknown
InChI: InChI=1S/C14H21N3O2S/c1-17(2)6-5-7-20-14-15-10-8-12(18-3)13(19-4)9-11(10)16-14/h8-9,15H,5-7H2,1-4H3
charge 0 multiplicity 1
41 atoms
S  2.145525 -1.899823 -0.044414
O  -5.391407 -0.270974 0.192885
O  -4.255043 2.26992 0.412009
N  6.975692 0.348063 0.003022
N  -0.648744 -1.961961 -0.00808
N  0.226052 0.141964 0.195502
C  4.661504 -0.659199 0.058568
C  5.5246 0.621834 0.13358
C  3.169223 -0.298001 0.035431
C  -1.755746 -1.099802 0.101482
C  -1.189604 0.209016 0.227798
C  0.502754 -1.161144 0.055403
C  -3.145105 -1.332654 0.094731
C  -2.042672 1.325197 0.366548
C  7.534005 -0.405045 1.145071
C  7.743792 1.58334 -0.260088
C  -3.985617 -0.20156 0.219118
C  -3.434703 1.122809 0.364513
C  -5.995855 -1.579375 -0.05598
C  -5.193828 2.359942 1.54879
H  4.945499 -1.214439 -0.854838
H  4.868883 -1.314527 0.925305
H  5.289383 1.171102 1.084807
H  5.237726 1.290426 -0.701434
H  2.889093 0.301233 -0.845487
H  2.842054 0.237221 0.940937
H  -0.669168 -2.973768 -0.118865
H  -3.558059 -2.339072 -0.013232
H  -1.651204 2.340687 0.464632
H  7.426875 0.134612 2.121725
H  8.609549 -0.587107 0.971843
H  7.041027 -1.387057 1.239526
H  7.355996 2.076678 -1.169144
H  8.80446 1.329246 -0.436084
H  7.702224 2.323237 0.58027
H  -5.6632 -1.995061 -1.027214
H  -7.079982 -1.39537 -0.083441
H  -5.760291 -2.295955 0.755832
H  -5.694395 3.333337 1.430282
H  -4.641686 2.336459 2.509134
H  -5.932908 1.541571 1.515957
