program: Gaussian 09
title: 000052933
version: EM64L-G09RevD.01
frameworkgroup: C1[X(C13H19NO5S)]
method: RPBEPBE
basis: SDD
operation: Freq
keyword: #p
keyword: freq=noraman
keyword: PBEPBE/SDD
title: #p freq=noraman PBEPBE/SDD
converged: YES YES NO NO
title: Mulliken charges:
elementType: S O O O O O N C C C C C C C C C C C C C H H H H H H H H H H H H H H H H H H H
charge: 0.924546 -0.251557 -0.541048 -0.534493 -0.256371 -0.264467 -0.233546 -0.231371 0.289712 -0.183642 -0.484139 0.049001 0.355056 0.190488 -0.365714 -0.610232 -0.611473 -0.687783 -0.696335 -0.537662 0.312808 0.293321 0.234891 0.267576 0.253020 0.238836 0.244221 0.275008 0.228339 0.238879 0.214405 0.250377 0.223971 0.203584 0.268346 0.217981 0.235003 0.229140 0.251322
chargesum: 0.00000
title: Mulliken charges with hydrogens summed into heavy atoms:
elementType: S O O O O O N C C C C C C C C C C C C C
charge: 0.924546 -0.251557 -0.541048 -0.534493 -0.256371 -0.264467 -0.233546 -0.231371 0.289712 0.129166 -0.190818 0.283892 0.355056 0.190488 -0.098138 0.125846 0.130753 0.000971 -0.006425 0.177803
polarizability: 2.65267508e+02 -2.52653309e+00 2.03565415e+02 7.11627915e-01 -5.05729704e+00 1.34199441e+02
1716.lowfreq: -6.8735 0.0009 0.0013 0.0015 4.4868 5.8984 19.9697 30.6114 42.9894
frequency: 19.5150 30.5256 42.9734 55.4106 66.8365 85.9883 92.8617 99.3753 141.9092 149.3215 159.6032 167.5093 184.9230 194.4107 201.9394 211.1752 224.8942 230.9415 239.8426 254.6226 255.7671 274.0385 287.1867 322.2723 332.9211 363.5015 391.0776 394.1886 398.5802 427.9983 440.6976 451.8561 462.5100 496.9631 514.3766 568.6783 609.4780 648.4292 694.4025 741.0800 752.1785 779.7333 797.8028 840.2666 852.1741 877.9143 905.2368 911.8030 924.5449 933.7878 942.4190 982.8832 987.2169 993.2175 998.5473 1070.5431 1095.8863 1104.6858 1111.7869 1112.8801 1135.4010 1139.8293 1158.1672 1158.9814 1186.9816 1196.9852 1213.8710 1247.6914 1276.0572 1326.5621 1331.2744 1377.7087 1385.0970 1392.8677 1395.0267 1403.0940 1417.8841 1439.2008 1443.1936 1453.0844 1460.6605 1462.5253 1462.8871 1466.0194 1469.4324 1473.8029 1475.3849 1482.1614 1498.0254 1573.5229 1589.8018 1599.4890 2943.3681 2949.4301 2972.8617 2989.4843 2992.9129 3031.0436 3046.2726 3050.5748 3066.3450 3084.2758 3090.7583 3092.3846 3103.3873 3104.5048 3108.5697 3136.5940 3145.2318 3169.8567 3176.8009
redmass: 4.3691 3.4844 3.3311 3.8712 4.0509 4.4097 3.7130 4.5395 5.2000 4.4554 3.7204 3.2994 2.4658 1.1362 1.8912 1.4168 2.4585 2.3203 1.8119 1.5999 1.6973 3.3972 3.6103 5.1335 5.9001 3.8105 3.5649 4.1277 3.2163 4.4561 3.4325 4.8874 3.8152 4.9967 6.1372 4.9850 5.6469 7.3230 4.3142 5.4070 5.3437 4.8633 16.4897 4.5498 1.4326 3.9780 1.8623 2.6667 14.8469 1.2560 1.3216 2.6761 3.3976 2.5243 1.5977 1.2497 2.0895 1.8535 1.4331 1.2591 1.6143 3.2673 2.0031 1.3361 1.9606 1.6156 2.7436 2.1486 1.9248 1.4172 1.4589 1.2484 3.2142 4.4932 1.4502 1.1334 1.1379 1.2728 1.0459 1.0530 1.0433 1.8542 1.0506 1.0567 1.0499 1.2197 1.0547 1.0577 1.0522 8.5348 8.7066 6.9429 1.0405 1.0381 1.0325 1.0354 1.0356 1.0867 1.0943 1.0946 1.1046 1.0993 1.0997 1.0986 1.1010 1.0982 1.1009 1.1005 1.0898 1.0906 1.0954
irintensity: 1.2920 0.2078 2.0612 3.3915 2.3730 1.1051 0.2309 0.9825 3.7832 5.0091 0.7914 1.8325 2.4453 0.2341 2.5138 1.4102 5.4804 4.7528 2.8322 9.0950 3.4426 5.1311 3.5738 0.3786 3.7399 4.4849 7.9443 1.8881 9.0058 15.2248 12.4579 9.4290 23.2136 49.8739 49.3450 38.5074 5.0934 0.2770 0.9526 2.9507 13.2849 28.7546 73.6364 26.3168 39.2106 14.9321 30.0133 45.8846 80.4518 3.7148 0.1577 26.8973 14.4295 61.9050 1.4534 0.8949 111.3012 21.1782 34.6520 0.1297 16.9053 12.0258 9.5246 3.6259 48.6022 20.6635 99.8577 286.0499 197.8630 7.3146 5.0467 32.3073 84.5539 58.3074 4.6288 14.7684 7.7344 4.7078 20.5622 12.4616 16.2762 95.9970 11.1422 7.4521 15.8478 6.1604 11.1344 22.3312 24.4358 129.6835 158.8536 41.9760 61.8177 55.4205 49.9253 10.9907 28.8099 3.9273 12.8933 16.6890 36.0583 1.4242 16.3691 61.7337 12.0121 2.7275 19.1076 23.0473 9.0011 4.2917 5.6150
temp: 298.150 k
press: 1.00000 atm
elementType: 16 8 8 8 8 8 7 6 6 6 6 6 6 6 6 6 6 6 6 6 1 1 1 1 1 1 1 1 1 1 1 1 1 1 1 1 1 1 1
symmnumber: 1
zpe: 797032.4 jmol-1
zpe.correction: 0.303574 hartree
zpe.thermalcorrener: 0.326617 hartree
zpe.thermalcorrenthalpy: 0.327561 hartree
zpe.thermalcorrgfe: 0.250614 hartree
zpe.sumelectzpe: -1333.979168 hartree
zpe.sumelectthermal: -1333.956124 hartree
zpe.sumelectthermalent: -1333.955180 hartree
zpe.sumelectthermalfe: -1334.032127 hartree
dipole: -1.3730 1.8234 4.8852
dipole: 5.3921
quadrupole: -102.1259 -128.5493 -132.1415
quadrupole: -0.0827 6.2127 -6.2232
quadrupole: 18.8130 -7.6104 -11.2026 -0.0827 6.2127 -6.2232
hfenergy: -1334.2827413 hartree
pointgroup: C01 [X(C13H19N1O5S1)]
dipole: 0.1273175 -1.262084 1.7004 debye
polarizability: 242.0873839|-28.4053279|220.6151638|-9.2914443|23.7060601|140.3298165 unknown
InChI: InChI=1S/C13H19NO5S/c1-9(2)19-13(15)11-8-10(18-5)6-7-12(11)20(16,17)14(3)4/h6-9H,1-5H3
charge 0 multiplicity 1
39 atoms
S  -0.02661 1.973527 -0.165108
O  -1.683596 -0.655352 0.103864
O  1.03092 3.222215 -0.303746
O  -1.230922 1.883253 -1.25034
O  4.078853 -2.531524 -0.299766
O  -0.982979 -2.550457 -1.053665
N  -0.809099 2.029746 1.612521
C  1.084264 0.409388 -0.129712
C  0.666892 -0.930052 -0.315296
C  2.450663 0.747395 -0.018585
C  1.67176 -1.931009 -0.386707
C  -3.132278 -1.073789 -0.069397
C  3.04025 -1.60526 -0.251863
C  -0.735886 -1.457848 -0.477509
C  3.430649 -0.255444 -0.062933
C  0.274978 2.402041 2.563899
C  -1.90354 3.042867 1.567709
C  -3.472329 -2.100145 1.01957
C  -3.941831 0.219852 0.003991
C  3.732169 -3.942437 -0.525721
H  2.726876 1.803958 0.066435
H  1.330507 -2.954331 -0.5657
H  -3.204059 -1.539059 -1.069896
H  4.493704 -0.014932 0.024542
H  1.080045 1.649039 2.526569
H  -0.170821 2.371872 3.575214
H  0.702164 3.411116 2.385871
H  -2.531612 2.852269 0.682723
H  -1.542943 4.093334 1.543057
H  -2.518428 2.892066 2.473986
H  -4.538659 -2.38203 0.944226
H  -2.86541 -3.013762 0.905477
H  -3.296837 -1.670166 2.021449
H  -5.004575 0.004108 -0.209551
H  -3.563542 0.946841 -0.733496
H  -3.869703 0.665925 1.011261
H  3.221035 -4.075808 -1.497523
H  3.094264 -4.330859 0.290577
H  4.694567 -4.473246 -0.532927
