program: Gaussian 09
title: 000052840
version: EM64L-G09RevD.01
frameworkgroup: C1[X(C12H16ClNO2)]
method: RPBEPBE
basis: SDD
operation: Freq
keyword: #p
keyword: freq=noraman
keyword: PBEPBE/SDD
title: #p freq=noraman PBEPBE/SDD
converged: NO YES NO NO
title: Mulliken charges:
elementType: Cl O O N C C C C C C C C C C C C H H H H H H H H H H H H H H H H
charge: -0.065648 -0.245946 -0.249420 -0.615229 0.241519 -0.395044 -0.416690 -0.345960 -0.044574 -0.724059 0.368849 -0.385414 -0.375031 -0.206286 -0.209064 -0.099924 0.224234 0.219817 0.218120 0.233886 0.247642 0.185529 0.200165 0.272677 0.267354 0.232427 0.192204 0.227162 0.271274 0.266052 0.254638 0.254740
chargesum: 0.00000
title: Mulliken charges with hydrogens summed into heavy atoms:
elementType: Cl O O N C C C C C C C C C C C C
charge: -0.065648 -0.245946 -0.249420 -0.075198 0.241519 0.049006 0.035317 0.087210 0.155591 -0.072265 0.368849 -0.114140 -0.108979 0.048353 0.045676 -0.099924
polarizability: 2.14399247e+02 7.17196702e+00 1.31510942e+02 1.16578731e+01 -1.32967898e+01 1.03732471e+02
1716.lowfreq: -6.5417 -4.1061 -0.0028 -0.0024 -0.0019 10.4905 28.6206 38.0836 61.7390
frequency: 28.5747 37.8772 61.7314 95.4144 101.8565 180.0131 194.5928 208.7175 223.4554 238.2244 261.3771 295.2625 299.7158 311.8532 366.3880 387.3708 408.7213 415.6126 436.5249 468.0821 483.9565 507.9137 544.0543 616.9358 623.4085 659.6846 682.7195 713.4877 721.9200 780.4024 806.0651 835.9745 874.8425 897.0086 915.1845 922.6998 934.8799 959.1244 967.8509 977.8793 993.8557 1001.4466 1003.8166 1037.1750 1053.9337 1070.9376 1083.1754 1108.3731 1149.2482 1178.3595 1180.0307 1188.4522 1214.1403 1255.2017 1265.6752 1290.1184 1306.4433 1316.8354 1327.6437 1347.7658 1352.2684 1362.6763 1377.2162 1389.5349 1392.0105 1454.8395 1458.5754 1469.2231 1479.3630 1480.5164 1491.8664 1589.7033 1606.2371 1645.0894 2860.1943 2959.8860 2965.6844 2969.5006 2976.1586 3044.8893 3067.8836 3070.0442 3078.1179 3083.0629 3158.4972 3159.9394 3176.5610 3181.0404 3430.0282 3552.8649
redmass: 3.7188 5.4364 2.3837 6.1277 3.7380 4.9030 2.4835 6.4455 1.3735 2.1489 2.1114 2.7276 2.3825 5.0538 2.7776 3.3973 2.9239 2.4407 4.1060 3.5158 3.6783 3.9101 4.5472 5.2292 7.1196 1.4246 4.1703 4.5478 2.9750 1.3347 1.6946 1.2485 2.4608 5.3284 4.1189 2.0313 2.3966 4.9752 1.4586 1.3679 1.5221 3.7119 1.9630 5.4996 2.2832 2.6482 1.7807 1.3251 2.0191 2.1056 1.2019 1.1024 1.8966 1.4157 1.3895 1.2429 1.5237 1.3060 1.2706 1.6444 1.7736 1.4524 5.3030 3.2817 1.2364 1.0778 1.0779 1.0918 2.5951 1.0515 1.0531 7.9806 6.3132 1.0945 1.0806 1.0641 1.0654 1.0633 1.0398 1.0941 1.1002 1.0973 1.0995 1.0981 1.0885 1.0889 1.0966 1.0974 1.0449 1.0963
irintensity: 0.0178 0.1480 0.0720 0.5099 0.4464 2.1864 4.8589 1.3788 28.2822 2.9596 4.2734 7.4875 7.7097 2.9495 12.7744 1.6896 0.0361 10.7846 10.7892 11.3290 0.6076 4.5123 21.0901 14.1094 1.1660 242.2715 9.6527 10.0972 2.0158 14.6149 80.8239 0.6265 12.6371 65.8286 16.0176 6.7251 1.3811 29.8101 0.8174 0.0796 11.9363 92.2473 6.1714 180.0435 19.6423 28.2996 1.5124 3.1999 38.2860 1.3103 5.3960 3.9361 5.3003 5.9557 10.2803 0.4374 13.3422 5.7834 2.1570 13.7916 88.7969 0.1951 1.3972 11.8470 14.2030 6.1003 8.1469 29.8476 54.1770 10.8576 7.7215 3.0353 18.8210 41.5407 66.0350 27.8843 60.1911 53.2787 34.1319 0.2525 23.6060 47.3407 58.7865 25.8721 1.2072 1.3047 5.5630 0.8435 2.7983 0.6277
temp: 298.150 k
press: 1.00000 atm
elementType: 17 8 8 7 6 6 6 6 6 6 6 6 6 6 6 6 1 1 1 1 1 1 1 1 1 1 1 1 1 1 1 1
symmnumber: 1
zpe: 682490.2 jmol-1
zpe.correction: 0.259947 hartree
zpe.thermalcorrener: 0.275578 hartree
zpe.thermalcorrenthalpy: 0.276523 hartree
zpe.thermalcorrgfe: 0.216269 hartree
zpe.sumelectzpe: -1130.892241 hartree
zpe.sumelectthermal: -1130.876609 hartree
zpe.sumelectthermalent: -1130.875665 hartree
zpe.sumelectthermalfe: -1130.935918 hartree
dipole: -4.7297 -0.4177 -0.4527
dipole: 4.7696
quadrupole: -99.0441 -98.0109 -103.3006
quadrupole: -1.5962 -3.4212 -3.8722
quadrupole: 1.0744 2.1076 -3.1821 -1.5962 -3.4212 -3.8722
hfenergy: -1131.1521873 hartree
pointgroup: C01 [X(C12H16Cl1N1O2)]
dipole: -1.8524648 0.2588012 0.1506272 debye
polarizability: 213.5136308|-12.7338813|123.9837188|-11.0923805|-17.9429247|112.1453114 unknown
InChI: InChI=1S/C12H16ClNO2/c1-2-12(14)7-15-11(16-8-12)9-3-5-10(13)6-4-9/h3-6,11H,2,7-8,14H2,1H3
charge 0 multiplicity 1
32 atoms
Cl 5.708953 -0.673645 -0.35366
O  -0.821547 1.12617 -0.693579
O  -0.938306 -0.588965 1.010127
N  -4.39056 0.762681 0.421364
C  -3.060784 0.257061 0.007555
C  -2.234977 1.489331 -0.464288
C  -2.350021 -0.260097 1.288603
C  -3.096035 -0.818655 -1.12238
C  -0.23563 0.60601 0.543754
C  -3.848895 -2.115236 -0.759091
C  1.21702 0.261498 0.293704
C  1.83058 -0.801658 0.997762
C  1.980959 1.033875 -0.61341
C  3.198976 -1.094191 0.803517
C  3.35032 0.753837 -0.816846
C  3.937033 -0.306605 -0.100218
H  -2.593594 1.876417 -1.433715
H  -2.309294 2.285884 0.306781
H  -2.414491 0.526868 2.070307
H  -2.796375 -1.191788 1.672545
H  -2.057281 -1.059457 -1.413342
H  -3.576152 -0.351864 -2.008265
H  -0.352626 1.39553 1.329761
H  -4.974864 0.055131 0.881875
H  -4.90501 1.219993 -0.341486
H  -3.32804 -2.681667 0.033709
H  -4.882539 -1.910506 -0.4184
H  -3.920221 -2.778151 -1.639992
H  1.230886 -1.406367 1.683424
H  1.497618 1.840852 -1.171502
H  3.677756 -1.917267 1.34161
H  3.945341 1.345381 -1.518323
