program: Orca
programVersion: 5.0.3
elementType: C H C F F H
charge: 0
multiplicity: 1
keywords: opt Freq M062X def2-TZVP TightSCF defgrid3
frequency: 0.00 0.00 0.00 0.00 0.00 0.00 442.97 560.61 653.82 734.35 856.89 969.08 970.62 1359.11 1412.88 1822.06 3231.87 3336.18
frequency: 442.97 560.61 653.82 734.35 856.89 969.08 970.62 1359.11 1412.88 1822.06 3231.87 3336.18
formula: C2H2F2
InChI: InChI=1/C2H2F2/c1-2(3)4/h1H2
6 atoms
C  -2.195601 1.732334 -0.0000
H  -3.272569 1.740419 -0.0000
C  -1.539619 2.86916 -0.0000
F  -0.23029 2.990186 -0.0000
F  -2.089274 4.063967 0.0000
H  -1.649761 0.80385 0.0000
totalener: -277.07470612 hartree
nucrepener: 114.92557715 hartree
electener: -392.00028327 hartree
oneelecener: -609.78884931 hartree
twoeener: 217.78856603 hartree
kineticenergy: 275.75706826 hartree
xcener: -15.553665610564 hartree
energy: -688.1726 -688.1717 -291.6617 -287.0296 -39.3819 -37.6287 -24.3422 -20.3746 -18.5730 -17.3077 -16.9394 -15.1712 -14.7556 -14.2307 -13.5746 -9.1403 1.4731 2.6386 3.2949 3.7378 5.0635 5.3622 6.5002 7.2723 8.1852 8.6443 9.4582 10.4706 10.9324 13.0197 14.6253 15.2758 15.3223 16.2867 18.1826 18.9094 19.3715 19.8330 20.1161 21.6912 23.0527 25.4719 25.6020 26.0908 27.3171 29.1132 30.0458 31.6332 33.5149 38.2795 38.6794 40.1226 42.7792 43.8629 44.0753 48.2135 48.3386 49.5530 51.5656 52.8286 54.4247 54.5524 54.8132 59.3830 61.7279 63.1055 64.3571 65.9545 65.9615 66.2701 68.0004 69.2901 70.7092 71.1538 72.0859 74.9133 75.8239 77.1585 78.6903 80.8591 82.8809 82.9996 83.7758 83.8829 84.0949 85.5632 87.6541 90.2894 90.8794 90.9932 92.3069 93.1041 97.1749 102.2332 102.9412 104.1231 105.5926 106.7341 107.5259 108.2906 111.3431 115.6164 116.1828 122.4646 125.6431 126.8491 142.3672 143.5292 186.7896 187.0785 187.1612 187.2334 187.2938 189.8866 190.7166 192.7230 194.8366 195.6563 200.1484 200.2161 203.6978 213.3856 225.2630 227.7950 228.7665 228.8940 237.9631 238.4720 241.6249 243.0089 243.9324 244.3853 606.2046 628.5548 1557.2166 1562.0197 electronvolt
chargesum: 0.0000000
charge: -0.379188 0.156446 0.403502 -0.168573 -0.168668 0.156481
charge: -0.225919 0.139476 -0.495194 0.221241 0.220898 0.139499
qa: -0.3792 0.1564 0.4035 -0.1686 -0.1687 0.1565
va: 3.8060 0.9715 4.1154 1.1154 1.1154 0.9715
energy: -277.085681574372
dipole: -2.43472 2.17851 -0.25621 -4.21870 3.77435 -0.44435 0.00000 -0.00000 0.00000
magnitude: 0.51292 au
magnitude: 1.30375 debye
temp: 298.15 k
press: 1.00 atm
zeropoint: 0.03724903 hartree
thermalvibcorrection: 0.00084852 hartree
thermalrotcorrection: 0.00141627 hartree
thermaltrasncorrection: 0.00141627 hartree
thermaltotal: -277.04475148 hartree
thermalcorr: 0.00368106 hartree
nonthermalcorr: 0.03724903 hartree
totalcorr: 0.04093009 hartree
thermalcorrenthalpy: 0.00094421 hartree
totalenthalpy: -277.04380727 hartree
totalentropycorr: -0.03066231 hartree
gibbsenthalpy: -277.07446959 hartree
gibbsminuselec: 0.01121199 hartree
