program: Orca
programVersion: 5.0.4
elementType: C F C F F F
charge: 0
multiplicity: 1
keywords: opt Freq M062X def2-TZVP TightSCF defgrid3
frequency: 0.00 0.00 0.00 0.00 0.00 0.00 207.68 210.32 403.48 431.87 563.39 564.77 594.31 824.15 1231.60 1396.38 1401.75 1974.48
frequency: 207.68 210.32 403.48 431.87 563.39 564.77 594.31 824.15 1231.60 1396.38 1401.75 1974.48
formula: C2F4
InChI: InChI=1/C2F4/c3-1(4)2(5)6
6 atoms
C  -2.127452 1.751727 0.0000
F  -3.435209 1.655804 -0.000001
C  -1.485358 2.900966 0.0000
F  -1.523288 0.587988 0.0000
F  -0.177519 2.995691 -0.000001
F  -2.088768 4.064976 0.0000
totalener: -475.47265639 hartree
nucrepener: 250.55094181 hartree
electener: -726.02359820 hartree
oneelecener: -1156.26798994 hartree
twoeener: 430.24439174 hartree
kineticenergy: 474.54552477 hartree
xcener: -25.289303298617 hartree
energy: -688.7048 -688.7029 -688.7024 -688.7019 -292.0647 -292.0320 -40.0189 -39.6114 -38.3780 -38.0682 -25.1245 -21.1690 -19.8975 -19.6004 -18.3491 -18.2446 -17.1857 -16.4317 -15.8096 -15.6220 -15.4157 -14.9558 -14.9036 -9.0333 1.8364 2.3670 2.7091 3.6044 5.7928 6.9642 7.0296 7.5407 7.5586 7.7701 8.5208 10.0763 13.2693 13.8494 13.9375 13.9729 14.9514 15.1486 17.0138 17.1948 18.2863 18.8591 19.0135 19.4368 20.2050 20.7179 21.6193 22.7049 24.1087 25.0247 25.0680 26.0835 26.2800 28.4066 28.6462 29.9025 32.3200 34.6617 36.5205 37.4812 40.7568 41.1864 44.2385 45.9204 47.8137 50.1367 50.8319 51.0262 52.3986 53.0031 56.4745 57.6596 58.3650 58.9757 59.5953 60.5370 60.6083 62.2339 66.1962 66.5218 67.1754 67.2856 68.0953 69.9646 70.6914 70.9447 71.5858 75.4718 75.6482 76.8905 77.5579 79.4227 80.7387 81.3927 81.7593 82.1049 83.9090 84.7352 87.1814 88.5977 88.8815 88.9820 89.2579 89.9351 90.1912 91.4300 93.7624 97.2164 99.3947 100.4284 102.8674 104.2177 104.5746 105.0182 105.5104 106.4189 108.7616 111.1942 112.7806 113.5241 115.1670 118.5245 122.7586 125.6064 133.7897 137.3085 148.5170 148.7178 185.9801 186.5056 186.5380 186.5636 186.5652 186.6454 186.6708 187.1143 187.1678 187.1769 187.9111 188.7809 190.8926 191.1530 191.6522 192.0634 193.4451 193.8316 194.5440 195.1129 196.9633 197.9973 201.5975 202.0759 203.0483 205.4338 210.3814 221.4374 224.3687 225.4696 226.4163 226.9333 227.6698 228.2070 228.7206 231.6614 236.4304 236.6884 238.5287 238.9867 240.0758 241.3488 242.2398 242.5731 242.7935 243.6852 246.4007 250.1424 615.3283 635.2214 1552.1876 1559.1786 1563.0935 1564.9955 electronvolt
chargesum: -0.0000000
charge: 0.306427 -0.153258 0.306428 -0.153208 -0.153251 -0.153139
charge: -0.476895 0.238383 -0.477017 0.238483 0.238409 0.238636
qa: 0.3064 -0.1533 0.3064 -0.1532 -0.1533 -0.1531
va: 4.1317 1.1356 4.1317 1.1357 1.1356 1.1358
energy: -475.567012898205
dipole: -0.00019 -0.00015 -0.00033 0.00021 0.00038 0.00058 0.00000 -0.00000 0.00000
magnitude: 0.00067 au
magnitude: 0.00170 debye
temp: 298.15 k
press: 1.00 atm
zeropoint: 0.02233557 hartree
thermalvibcorrection: 0.00230613 hartree
thermalrotcorrection: 0.00141627 hartree
thermaltrasncorrection: 0.00141627 hartree
thermaltotal: -475.53953866 hartree
thermalcorr: 0.00513868 hartree
nonthermalcorr: 0.02233557 hartree
totalcorr: 0.02747424 hartree
thermalcorrenthalpy: 0.00094421 hartree
totalenthalpy: -475.53859445 hartree
totalentropycorr: -0.03513794 hartree
gibbsenthalpy: -475.57373239 hartree
gibbsminuselec: -0.00671949 hartree
