program: Gaussian 09
title: 000052843
version: EM64L-G09RevD.01
frameworkgroup: C1[X(C22H29NO2)]
method: RPBEPBE
basis: SDD
operation: Freq
keyword: #p
keyword: freq=noraman
keyword: PBEPBE/SDD
title: #p freq=noraman PBEPBE/SDD
converged: YES YES NO NO
title: Mulliken charges:
elementType: O O N C C C C C C C C C C C C C C C C C C C C C C H H H H H H H H H H H H H H H H H H H H H H H H H H H H H
charge: -0.306462 -0.275722 -0.114278 0.340119 -0.015509 -0.336755 -0.638504 -0.609833 -0.436418 0.487324 0.497224 -0.315928 -0.320813 -0.392400 -0.440135 -0.398942 -0.384073 -0.675928 -0.681781 -0.239860 -0.227258 -0.243134 -0.231543 -0.245862 -0.245773 0.208566 0.222355 0.234602 0.243312 0.213784 0.230158 0.231276 0.212903 0.237161 0.206374 0.188944 0.202710 0.187590 0.243214 0.229978 0.243217 0.267032 0.209792 0.224614 0.208489 0.223776 0.228512 0.206841 0.224349 0.223529 0.224413 0.222772 0.225894 0.226086
chargesum: 0.00000
title: Mulliken charges with hydrogens summed into heavy atoms:
elementType: O O N C C C C C C C C C C C C C C C C C C C C C C
charge: -0.306462 -0.275722 -0.114278 0.340119 0.193057 0.120202 -0.181407 -0.148399 0.013647 0.487324 0.497224 0.079391 0.069487 -0.149186 -0.210158 -0.155725 -0.117041 -0.033033 -0.022652 -0.015511 -0.003729 -0.018721 -0.008771 -0.019969 -0.019687
polarizability: 2.92485577e+02 1.52722596e+01 2.14826996e+02 1.97669488e-01 1.50973141e+01 2.16852406e+02
1716.lowfreq: -8.3339 -0.0006 -0.0003 -0.0001 0.8353 5.1569 18.0879 21.5389 29.2879
frequency: 17.6301 21.4907 29.1919 34.9182 38.9804 41.4032 57.0178 59.7432 82.3403 82.8698 88.2062 140.3550 145.6371 164.6396 192.5504 203.8181 224.0423 239.7779 259.0743 280.2895 285.1354 302.0922 330.9714 351.4086 359.1992 378.1750 403.9814 404.2126 443.6641 447.8424 451.1746 468.4723 499.6573 524.7320 580.0065 616.5781 617.1008 618.7653 634.3596 649.0700 702.1285 705.7711 723.6473 741.0335 761.1924 776.2428 781.9037 796.4021 801.3227 817.9901 834.9174 851.9721 852.9053 857.3912 889.4068 893.4008 916.9605 924.8911 927.6555 968.0189 972.7319 977.1635 978.8493 989.4503 990.0296 990.5308 991.6199 995.6505 1011.8706 1027.0182 1027.9711 1060.9398 1068.5565 1073.3173 1075.3450 1082.9755 1084.7127 1092.5094 1110.4495 1121.4761 1124.4655 1164.6918 1169.7545 1171.0290 1187.1169 1188.7089 1192.3479 1193.7586 1205.4824 1214.8779 1219.9749 1243.2869 1258.8448 1276.2924 1287.5434 1294.2900 1300.8283 1310.4071 1321.5535 1328.5321 1335.3648 1349.7016 1362.5643 1370.4851 1378.3233 1380.2605 1383.0366 1388.5287 1389.4167 1438.5875 1439.2820 1451.0266 1454.1440 1462.2047 1464.3679 1470.5961 1476.7122 1479.4546 1483.5921 1483.6713 1485.9030 1488.1443 1492.0427 1590.8628 1591.1108 1613.0038 1614.3970 2852.4574 2861.0054 2897.4446 2969.2966 2980.8703 2984.5095 2995.9714 3004.7535 3011.2639 3024.8171 3035.1368 3055.5701 3060.7521 3066.7874 3074.0138 3077.3977 3088.6331 3091.2248 3114.6717 3114.7630 3118.3059 3123.4541 3124.9255 3137.0181 3138.1270 3146.0821 3149.0702 3161.3184 3162.2522
redmass: 3.7428 4.0419 3.9027 4.1972 4.6313 3.7336 3.2853 3.4610 3.2323 2.9160 2.8031 2.2869 3.0286 3.3657 2.6980 1.5759 1.8007 3.1413 4.2979 2.8704 2.0435 4.1005 2.4639 2.2250 2.6400 2.6005 2.8303 2.8052 2.3036 2.7602 2.8688 3.4974 2.6342 4.1213 5.3576 5.5853 6.2544 4.4605 3.9414 4.7408 1.8560 1.8493 3.2759 2.5407 1.9949 2.4436 2.4888 1.1380 1.4691 3.7864 3.2813 1.8836 1.5503 1.2498 2.0700 1.8544 1.4957 1.7662 1.6651 5.0088 1.5486 1.9500 1.4205 2.2822 5.6867 4.1115 1.3385 1.4163 2.5047 2.1983 2.2078 2.6789 1.9177 1.8459 1.8006 1.7806 2.1177 1.9849 2.8773 1.7380 1.9564 1.4804 1.0569 1.0582 1.1252 1.1182 1.3190 1.9176 2.2141 2.2196 2.3691 1.5054 1.3784 1.1780 1.2374 1.2661 1.3265 1.4290 1.5102 1.2626 1.3517 1.3949 1.3375 1.3745 1.6114 6.6047 6.3770 1.2285 1.2322 1.9115 2.1175 1.1639 1.1380 1.0562 1.0548 1.0590 1.0806 1.0905 2.0982 1.8197 1.2608 1.0667 1.0712 6.0413 6.0395 6.1416 6.0979 1.0722 1.0715 1.0704 1.0845 1.0358 1.0358 1.0608 1.0606 1.0644 1.0873 1.0875 1.1005 1.0905 1.1006 1.0978 1.0982 1.1003 1.1003 1.1020 1.0865 1.0843 1.0867 1.0875 1.0923 1.0924 1.0966 1.0955 1.1016 1.1013
irintensity: 0.3018 0.0281 0.1023 0.0129 0.0972 0.2347 0.0221 0.1643 0.0293 0.7629 2.0067 1.7612 3.1551 3.3066 2.3887 0.4152 0.3621 2.3358 0.4206 1.4423 0.9766 3.2744 1.8638 0.6560 1.5069 2.6275 0.1430 0.0046 1.8391 2.8405 2.1668 7.1843 2.1279 33.9361 3.8629 7.8983 0.2499 13.3361 5.0503 9.3638 40.3013 71.4544 26.6330 22.7121 53.6105 11.7704 7.1306 4.1337 10.5527 2.5976 4.8052 17.2403 8.5292 0.6683 13.5114 0.5958 0.7961 2.1413 5.1982 70.7990 7.6111 10.8774 0.7769 14.7864 0.1403 0.7484 1.7570 1.0875 17.5804 6.7091 3.5863 83.1736 27.5301 23.6473 10.4254 28.7606 3.1023 85.9017 64.8319 7.2027 27.9938 4.9240 0.1176 0.2246 0.2203 1.9124 9.3365 5.3848 28.9733 0.9958 1.5950 41.2405 8.6360 4.4657 23.6384 6.6337 3.4334 5.9823 25.7995 0.2339 10.5383 1.1639 1.0531 4.6719 0.1703 0.1194 0.2865 21.3475 17.4051 2.4337 10.5298 11.0650 8.9175 3.9714 5.1821 6.5379 5.1156 6.6500 28.8600 15.7465 6.3954 10.2370 11.4621 0.9842 0.6449 9.5848 9.8960 28.9384 152.5723 86.0222 51.8577 21.1726 31.2334 21.2418 22.3872 45.4158 18.5533 20.3514 9.8336 19.8428 8.6615 50.5092 61.0713 30.6558 45.5890 26.2863 6.6492 2.0047 0.8051 1.2640 25.8801 21.9673 36.1816 28.0236 20.1727 24.0781
temp: 298.150 k
press: 1.00000 atm
elementType: 8 8 7 6 6 6 6 6 6 6 6 6 6 6 6 6 6 6 6 6 6 6 6 6 6 1 1 1 1 1 1 1 1 1 1 1 1 1 1 1 1 1 1 1 1 1 1 1 1 1 1 1 1 1
symmnumber: 1
zpe: 1205903.7 jmol-1
zpe.correction: 0.459304 hartree
zpe.thermalcorrener: 0.484191 hartree
zpe.thermalcorrenthalpy: 0.485135 hartree
zpe.thermalcorrgfe: 0.401089 hartree
zpe.sumelectzpe: -1059.030520 hartree
zpe.sumelectthermal: -1059.005633 hartree
zpe.sumelectthermalent: -1059.004689 hartree
zpe.sumelectthermalfe: -1059.088735 hartree
dipole: 1.7530 -0.9243 -0.8328
dipole: 2.1496
quadrupole: -138.4369 -149.2813 -146.9341
quadrupole: -1.9700 -3.2468 3.7468
quadrupole: 6.4472 -4.3972 -2.0500 -1.9700 -3.2468 3.7468
hfenergy: -1059.489824 hartree
pointgroup: C01 [X(C22H29N1O2)]
dipole: 0.6633657 0.4316641 0.2980801 debye
polarizability: 293.4289318|-12.603564|217.7346605|3.851746|14.4905838|213.0013867 unknown
InChI: InChI=1S/C22H29NO2/c1-3-23(4-2)17-21-18-24-22(25-21,15-19-11-7-5-8-12-19)16-20-13-9-6-10-14-20/h5-14,21H,3-4,15-18H2,1-2H3
charge 0 multiplicity 1
54 atoms
O  -0.254064 0.762565 0.144915
O  0.054185 -0.310962 -1.948753
N  3.350576 1.872761 0.192857
C  -0.926571 -0.103377 -0.855796
C  1.028352 1.242224 -0.439139
C  1.376765 0.148757 -1.465985
C  -1.313109 -1.439329 -0.170372
C  -2.130386 0.625347 -1.506236
C  2.040255 1.393387 0.704861
C  -0.131864 -2.25042 0.330189
C  -3.358367 0.796483 -0.622714
C  3.39184 3.356006 0.05197
C  4.505381 1.334966 0.964756
C  0.510829 -3.190799 -0.515928
C  -4.600368 0.227357 -1.003131
C  0.365212 -2.074221 1.647792
C  -3.295743 1.540594 0.586234
C  4.415404 3.836829 -0.993991
C  4.794829 -0.148953 0.670274
C  1.626179 -3.931089 -0.062136
C  -5.754117 0.395668 -0.203181
C  1.478714 -2.814489 2.107233
C  -4.44588 1.708739 1.388221
C  2.115188 -3.74526 1.252481
C  -5.680604 1.138142 0.997184
H  0.849033 2.210748 -0.950246
H  1.92919 -0.684571 -0.993631
H  1.928711 0.52676 -2.338596
H  -1.995623 -1.190392 0.661777
H  -1.896624 -2.020933 -0.908726
H  -1.750868 1.609635 -1.840893
H  -2.393288 0.057093 -2.417655
H  1.616743 2.071153 1.484179
H  2.164502 0.402002 1.173408
H  2.3860 3.693283 -0.260765
H  3.5946 3.849339 1.036772
H  5.395456 1.927437 0.685587
H  4.359917 1.481593 2.065518
H  0.139917 -3.329828 -1.537952
H  -4.665246 -0.348366 -1.93507
H  -0.122446 -1.348056 2.30818
H  -2.336521 1.971736 0.893094
H  5.448064 3.550067 -0.72549
H  4.187463 3.397032 -1.980608
H  4.387653 4.939038 -1.081963
H  4.977989 -0.292326 -0.409095
H  3.956946 -0.806906 0.964344
H  5.690148 -0.481435 1.228452
H  2.110516 -4.652571 -0.730177
H  -6.705455 -0.049769 -0.516152
H  1.844863 -2.670861 3.130606
H  -4.381314 2.286443 2.317705
H  2.976323 -4.32265 1.60805
H  -6.573089 1.272181 1.618944
