program: Orca
programVersion: 5.0.3
elementType: C F O O
charge: -1
multiplicity: 1
keywords: opt Freq M062X def2-TZVP TightSCF defgrid3
frequency: 0.00 0.00 0.00 0.00 0.00 0.00 585.39 603.52 808.02 841.08 1344.89 1893.00
frequency: 585.39 603.52 808.02 841.08 1344.89 1893.00
formula: CFO2
InChI: InChI=1/CFO2/c2-1(3)4
4 atoms
C  0.294823 1.324863 0.355437
F  -1.155602 1.324863 0.355437
O  0.749384 0.193346 0.355437
O  0.749384 2.45638 0.355437
totalener: -288.48123107 hartree
nucrepener: 108.41920058 hartree
electener: -396.90043165 hartree
oneelecener: -621.12330261 hartree
twoeener: 224.22287096 hartree
kineticenergy: 287.06625867 hartree
xcener: -15.955274810512 hartree
energy: -680.3613 -527.3536 -527.3530 -285.2324 -30.2966 -26.0463 -24.3075 -12.1383 -9.5180 -9.4205 -9.0900 -7.2694 -6.6095 -4.7589 -3.8200 -3.4954 8.4357 9.0149 11.1321 11.5331 11.7944 13.2041 16.7638 17.8771 18.6435 19.6683 21.0142 21.0850 21.7262 23.3176 24.6145 25.0689 25.2492 25.7361 27.6928 29.6189 30.5238 31.1885 32.8125 39.5675 41.8368 44.7206 45.3438 46.0681 48.3178 50.9060 52.2006 53.9216 57.7514 59.3514 59.5452 61.1322 62.9605 64.4375 66.0755 67.5496 69.0610 70.2334 72.5481 72.6219 81.2980 81.5810 85.5631 86.2190 86.2943 86.7804 87.1158 88.2681 90.0154 90.2158 92.0882 93.1344 96.5771 100.2456 100.8199 102.8145 104.7348 104.9926 108.4506 109.4218 112.5436 123.4208 126.7516 141.1025 146.9223 147.1121 147.9370 150.2408 154.0985 155.1471 157.2634 158.2393 164.9775 167.6462 172.5169 173.9252 177.5857 179.0576 180.6188 181.4632 183.5813 183.9450 188.6807 192.8822 193.4168 194.4856 194.7358 194.8647 196.8299 196.9892 199.3371 199.6612 201.2844 208.3427 216.5485 233.1745 235.4945 241.8591 246.2209 251.1965 644.4938 1200.6191 1200.6952 1560.9714 electronvolt
chargesum: -1.0000000
charge: 0.379468 -0.345719 -0.516874 -0.516874
charge: -0.793511 -0.062405 -0.072042 -0.072042
qa: 0.3795 -0.3457 -0.5169 -0.5169
va: 4.7383 0.8079 1.9463 1.9463
energy: -288.507260605568
dipole: 1.17210 -1.64594 -0.47384 -0.00000 -0.00000 -0.00000 0.00000 0.00000 0.00000
magnitude: 0.47384 au
magnitude: 1.20440 debye
temp: 298.15 k
press: 1.00 atm
zeropoint: 0.01384193 hartree
thermalvibcorrection: 0.00047997 hartree
thermalrotcorrection: 0.00141627 hartree
thermaltrasncorrection: 0.00141627 hartree
thermaltotal: -288.49010617 hartree
thermalcorr: 0.00331251 hartree
nonthermalcorr: 0.01384193 hartree
totalcorr: 0.01715444 hartree
thermalcorrenthalpy: 0.00094421 hartree
totalenthalpy: -288.48916196 hartree
totalentropycorr: -0.02933570 hartree
gibbsenthalpy: -288.51849766 hartree
gibbsminuselec: -0.01123705 hartree
