program: Orca
programVersion: 5.0.2
elementType: C C H C O O H F F H
charge: -1
multiplicity: 1
keywords: optTS freq M062X def2-TZVP TightSCF defgrid3
keywords: PAL8
frequency: 0.00 0.00 0.00 0.00 0.00 0.00 -251.22 40.51 103.05 115.53 127.94 177.37 323.26 467.99 512.48 549.28 603.89 608.38 688.81 863.61 1083.22 1228.77 1267.55 1380.24 1390.30 1485.23 2400.71 3118.30 3186.52 3280.52
frequency: 40.51 103.05 115.53 127.94 177.37 323.26 467.99 512.48 549.28 603.89 608.38 688.81 863.61 1083.22 1228.77 1267.55 1380.24 1390.30 1485.23 2400.71 3118.30 3186.52 3280.52
formula: C3H3F2O2
InChI: InChI=1/C2H3F2.CO2/c1-2(3)4;2-1-3/h2H,1H2;
10 atoms
C  -0.039728 -1.010744 -0.57107
C  0.295717 -0.761084 0.757457
H  -0.454149 -0.795161 1.535022
C  -0.048786 2.016931 0.21454
O  -1.069446 2.098475 0.756606
O  0.972458 2.156032 -0.318001
H  0.797459 -1.156222 -1.252252
F  -0.986917 -2.020909 -0.813014
F  -0.800579 0.094991 -1.32573
H  1.333972 -0.622308 1.016443
totalener: -466.29213077 hartree
nucrepener: 292.45482047 hartree
electener: -758.74695123 hartree
oneelecener: -1233.90144723 hartree
twoeener: 475.15449600 hartree
kineticenergy: 464.52916537 hartree
xcener: -26.733806359634 hartree
temp: 298.15 k
press: 1.00 atm
thermalcorrenthalpy: 0.00094421 hartree
totalenthalpy: -466.22722826 hartree
totalentropycorr: -0.04006397 hartree
gibbsenthalpy: -466.26729222 hartree
gibbsminuselec: 0.02483854 hartree
totalenthalpy: -466.22822882 hartree
totalenthalpy: -466.22992888 hartree
totalenthalpy: -466.23114547 hartree
totalenthalpy: -466.23167642 hartree
totalenthalpy: -466.23181068 hartree
energy: -681.1556 -679.9890 -531.4022 -531.3995 -287.4146 -284.9092 -279.8111 -31.2382 -30.3632 -29.0046 -28.9693 -17.5195 -13.4469 -13.2874 -11.9531 -11.7822 -11.6786 -11.1195 -10.2542 -9.5969 -7.9196 -7.7611 -7.4592 -7.3774 -6.8515 -6.7807 -5.8005 -1.0422 6.2588 6.8742 7.0619 7.2812 7.8588 8.5180 8.9904 9.1899 10.0721 10.5128 11.1036 11.7929 12.1999 12.8138 13.7609 14.2003 14.7162 14.9517 15.3761 15.9627 16.4557 16.5963 17.4944 17.5477 18.1459 18.5664 20.3097 20.4930 20.6653 21.8523 22.1347 22.9208 23.8019 24.6448 25.1617 25.7527 26.2107 27.1463 27.8243 28.2351 29.0730 29.9175 30.2728 31.6061 31.9686 32.4348 32.8527 33.1303 34.3440 34.8790 35.6293 35.8637 37.1979 38.4327 40.3014 41.0317 42.1615 42.8184 44.0115 44.4785 44.7595 45.5281 47.4768 48.3299 50.0535 50.8251 50.9310 51.9147 52.4138 52.9146 53.6192 55.8638 56.7758 57.4123 57.9591 58.1673 58.3390 58.8330 60.1115 60.4747 62.0909 62.6381 64.0933 64.8415 65.8350 67.1631 68.4403 68.8794 70.2276 70.7765 71.3440 71.4673 74.7657 75.2608 75.9538 76.6881 77.1237 77.8395 78.6659 79.9736 80.4145 81.1303 81.2357 81.8769 82.1080 83.0243 84.5782 84.7455 84.8279 85.3133 86.5957 87.0541 87.5077 88.0194 88.8619 89.2919 90.6221 91.1807 91.6084 92.4661 93.3138 93.3956 94.7048 95.2338 96.6383 96.8953 97.4941 98.2305 99.1994 101.4584 102.0579 103.9724 104.2284 106.0215 106.7838 108.6294 109.3507 110.3855 111.0332 113.1893 114.0272 116.8773 117.3782 119.8237 121.6909 127.7101 130.4421 133.9823 135.4518 136.2898 142.4021 143.2194 143.2398 144.8820 144.9083 147.2054 147.2741 147.3393 161.8193 161.8826 168.1137 171.1459 172.7342 175.9151 176.0501 176.3320 176.5599 180.6634 181.8950 184.3092 186.6191 193.0739 193.9507 194.0933 194.2343 194.5194 194.8029 194.8818 195.5508 195.6439 196.6885 197.2312 198.5982 199.8896 200.3711 203.2702 204.2325 205.6411 205.8967 209.1984 232.6842 234.0869 234.8543 235.7418 240.3353 242.7045 244.4116 248.4634 250.2009 252.2829 610.1801 620.7466 658.1909 1203.8745 1206.7824 1560.1692 1566.4243 electronvolt
chargesum: -1.0000000
charge: 0.259451 -0.710798 0.083857 0.364091 -0.218780 -0.228524 0.024554 -0.281526 -0.379300 0.086975
charge: -0.482454 -0.543414 0.089908 -0.465151 0.170649 0.162758 0.104075 0.019523 -0.147761 0.091868
qa: 0.2595 -0.7108 0.0839 0.3641 -0.2188 -0.2285 0.0246 -0.2815 -0.3793 0.0870
va: 4.1991 3.3745 0.9885 4.5021 2.2817 2.2630 0.9538 0.8724 0.7474 0.9732
energy: -466.297731890037
dipole: 3.51306 -3.25420 0.25886 -0.85648 1.98203 1.12555 3.45682 -3.60381 -0.14700
magnitude: 1.16425 au
magnitude: 2.95929 debye
zeropoint: 0.05696206 hartree
thermalvibcorrection: 0.00518260 hartree
thermalrotcorrection: 0.00141627 hartree
thermaltrasncorrection: 0.00141627 hartree
thermaltotal: -466.23275468 hartree
thermalcorr: 0.00801515 hartree
nonthermalcorr: 0.05696206 hartree
totalcorr: 0.06497721 hartree
totalenthalpy: -466.23181047 hartree
