program: Orca
programVersion: 5.0.3
elementType: C C H C O O F F H F
charge: -1
multiplicity: 1
keywords: opt Freq M062X def2-TZVP TightSCF defgrid3
frequency: 0.00 0.00 0.00 0.00 0.00 0.00 38.49 86.99 158.99 261.66 272.41 369.26 446.71 516.41 586.42 741.34 807.13 933.45 1085.62 1110.87 1134.45 1175.71 1245.68 1325.28 1377.79 1400.38 1453.64 1766.91 3115.46 3159.42
frequency: 38.49 86.99 158.99 261.66 272.41 369.26 446.71 516.41 586.42 741.34 807.13 933.45 1085.62 1110.87 1134.45 1175.71 1245.68 1325.28 1377.79 1400.38 1453.64 1766.91 3115.46 3159.42
formula: C3H2F3O2
InChI: InChI=1/C3H2F3O2/c4-1(2(5)6)3(7)8/h1-2H
10 atoms
C  -2.427676 -0.772326 -0.013959
C  -2.099978 -0.103232 1.294494
H  -2.550471 -0.647305 2.126485
C  -2.551275 1.395349 1.267547
O  -3.207398 1.766645 2.250353
O  -2.180625 2.004689 0.248297
F  -1.972795 -2.066243 -0.038079
F  -3.777569 -0.84612 -0.163654
H  -2.000298 -0.233455 -0.858174
F  -0.715963 -0.184193 1.426949
totalener: -565.59057498 hartree
nucrepener: 393.60991502 hartree
electener: -959.20049000 hartree
oneelecener: -1575.52685008 hartree
twoeener: 616.32636008 hartree
kineticenergy: 563.26648130 hartree
xcener: -31.583749893024 hartree
energy: -683.5648 -683.5262 -682.6926 -527.5940 -527.5927 -287.2236 -284.6369 -284.4107 -34.4607 -32.8421 -32.5083 -26.5816 -24.1298 -19.7643 -16.6082 -14.0570 -13.8439 -13.3374 -12.2805 -11.6704 -10.7862 -10.5770 -10.1556 -9.9356 -9.2517 -8.5347 -8.3820 -7.9982 -7.0816 -3.9227 -3.9007 -3.6490 6.1776 6.6604 6.8752 8.2300 8.2996 9.1091 9.6945 10.5415 11.2753 11.5437 11.6439 12.3676 12.6476 13.0647 13.8948 14.3690 14.9037 15.2775 15.7749 15.9261 16.7151 17.2154 17.4854 18.7227 19.2109 19.5517 19.7990 20.0240 21.0673 21.3038 21.9673 22.6591 22.8795 23.6873 24.2614 25.2284 25.4744 26.3843 26.8174 27.0683 27.5864 27.6553 28.7502 30.0009 30.3977 30.7575 31.4512 32.0001 32.7348 33.5590 34.2073 35.1375 35.6698 36.4195 37.1391 39.3742 40.4665 43.0504 43.1456 44.1110 45.5051 46.7754 47.0127 47.8761 48.9959 50.0826 50.9713 51.7545 52.6429 53.5261 54.5153 54.9461 55.6307 56.5968 57.1029 57.2752 58.4878 59.1300 60.7035 61.6982 62.8863 63.2781 63.6384 64.3865 64.6225 66.0729 66.1937 67.5445 67.8084 68.5188 69.3663 69.6611 70.0428 70.3540 71.2070 72.2412 73.3289 74.3783 75.4508 77.0850 78.7154 80.5826 80.8679 81.2690 82.2473 82.5547 83.0805 84.2642 85.0131 85.1988 86.3006 86.9733 87.2838 88.3316 88.9855 89.5081 90.4316 90.5328 90.7969 91.3281 91.9502 93.3851 93.8957 94.3757 95.1345 96.2633 98.0567 98.5652 98.8167 99.5284 99.9017 100.5179 101.2979 102.1363 103.0914 104.4500 105.3577 106.5922 107.3651 108.1078 109.3172 110.4941 111.3020 112.3279 113.1002 113.6869 113.9904 114.8780 118.0062 118.6110 120.2525 121.7038 124.9842 126.8117 129.4468 131.3975 134.6981 144.2138 146.7798 147.2988 147.7547 147.9422 148.5460 151.3173 152.9539 155.6898 157.7116 158.2966 165.0629 169.6022 172.3042 172.8711 178.2870 179.6209 180.8440 181.4608 181.9035 187.6850 189.3353 191.5585 191.6003 191.6897 191.8229 191.9341 192.1745 192.4976 192.8224 193.0505 193.9070 194.4113 194.9084 195.2129 196.1877 197.0533 198.5932 199.6322 199.6611 200.1800 201.1163 202.0657 202.8023 203.5591 204.2469 204.5851 208.4336 229.9807 231.4696 232.2945 232.7019 233.0764 233.9724 240.4801 242.4222 243.3417 244.2187 245.6385 247.1015 248.3054 248.6484 249.4912 615.2005 620.2455 647.2294 1202.5823 1203.5025 1562.9981 1564.8772 1567.9129 electronvolt
chargesum: -1.0000000
charge: 0.266757 0.062159 0.080029 0.247607 -0.507555 -0.525270 -0.242912 -0.224749 0.101557 -0.257623
charge: -0.435956 -0.300105 0.130645 -0.684652 -0.068231 -0.075900 0.097512 0.129198 0.125927 0.081561
qa: 0.2668 0.0622 0.0800 0.2476 -0.5076 -0.5253 -0.2429 -0.2247 0.1016 -0.2576
va: 4.0440 3.7444 0.9904 4.5787 1.9238 1.9016 0.9790 1.0079 0.9964 0.9446
energy: -565.611666039560
dipole: -0.41176 0.76026 0.34849 2.14574 -4.46736 -2.32162 0.74591 -1.46068 -0.71478
magnitude: 2.45403 au
magnitude: 6.23766 debye
temp: 298.15 k
press: 1.00 atm
zeropoint: 0.05597562 hartree
thermalvibcorrection: 0.00451888 hartree
thermalrotcorrection: 0.00141627 hartree
thermaltrasncorrection: 0.00141627 hartree
thermaltotal: -565.54833900 hartree
thermalcorr: 0.00735142 hartree
nonthermalcorr: 0.05597562 hartree
totalcorr: 0.06332704 hartree
thermalcorrenthalpy: 0.00094421 hartree
totalenthalpy: -565.54739479 hartree
totalentropycorr: -0.04065151 hartree
gibbsenthalpy: -565.58804630 hartree
gibbsminuselec: 0.02361974 hartree
