program: Orca
programVersion: 5.0.3
elementType: C C H C O O F F H H
charge: -1
multiplicity: 1
keywords: opt Freq M062X def2-TZVP TightSCF defgrid3
frequency: 0.00 0.00 0.00 0.00 0.00 0.00 55.94 122.23 211.32 262.56 349.50 427.07 520.50 677.67 789.13 905.29 946.52 1050.74 1127.47 1160.90 1243.44 1273.77 1359.05 1388.89 1434.30 1498.93 1768.97 3083.38 3094.61 3177.13
frequency: 55.94 122.23 211.32 262.56 349.50 427.07 520.50 677.67 789.13 905.29 946.52 1050.74 1127.47 1160.90 1243.44 1273.77 1359.05 1388.89 1434.30 1498.93 1768.97 3083.38 3094.61 3177.13
formula: C3H3F2O2
InChI: InChI=1/C3H3F2O2/c4-1-2(5)3(6)7/h2H,1H2
10 atoms
C  -2.536273 -0.807911 0.056938
C  -1.936142 -0.052303 1.20498
H  -2.18302 -0.551982 2.145653
C  -2.52655 1.395864 1.239237
O  -3.765477 1.386857 1.390225
O  -1.728274 2.327399 1.111147
F  -2.21226 -2.169512 0.109955
F  -0.553339 -0.081073 1.073931
H  -3.61886 -0.711596 0.094751
H  -2.143856 -0.421938 -0.886561
totalener: -466.32731877 hartree
nucrepener: 304.60300615 hartree
electener: -770.93032491 hartree
oneelecener: -1258.47346165 hartree
twoeener: 487.54313674 hartree
kineticenergy: 464.41228905 hartree
xcener: -26.764025566282 hartree
energy: -682.7651 -682.1500 -527.4488 -527.4149 -284.7929 -284.3141 -284.2395 -32.6104 -32.0029 -26.4392 -23.9771 -19.5151 -15.8848 -12.7838 -12.4974 -11.8504 -11.3111 -10.9327 -9.9008 -9.4130 -8.2513 -8.2104 -7.9610 -7.7026 -6.6906 -3.7930 -3.7595 -3.4870 6.3111 6.5464 7.0256 7.8273 8.0583 8.4922 9.6316 9.8352 11.3230 11.6156 12.2516 12.4998 12.9730 13.2331 13.4584 14.4896 15.2736 15.6092 15.8664 16.1389 16.6342 17.4777 17.8771 18.7092 19.2029 19.6162 19.7808 20.4812 21.0024 21.5816 22.1017 22.8690 23.0332 24.0924 25.4734 25.6959 26.3340 26.9676 27.2591 28.4440 29.1278 29.5041 30.2965 30.7551 31.2903 31.9451 33.7699 33.9034 34.4577 35.4643 36.4043 37.0958 37.8600 38.4806 42.4640 43.8565 44.5869 45.5683 46.3816 46.9284 47.5959 48.6056 49.0790 50.0102 50.7457 51.8218 53.0795 54.0453 54.5751 55.2311 56.1639 57.1815 57.5794 58.5936 59.2097 60.6284 61.7508 61.9412 63.0145 63.7840 64.8692 65.2041 66.3413 67.0398 67.8044 68.6544 69.1496 69.6312 69.8331 70.3489 72.2427 73.0886 73.3165 73.6271 75.7532 77.3267 77.9998 78.7732 80.1339 81.6614 82.8060 82.9110 83.2976 84.8571 85.3083 85.7809 86.8427 87.1610 87.5682 88.6703 89.0772 89.8491 90.8291 91.5974 91.9374 92.3919 93.2823 94.0858 94.9425 95.4600 96.7415 97.7493 98.5483 98.8085 99.5212 100.3145 101.4692 101.8999 102.3960 104.0378 104.8196 106.3278 108.4943 109.0178 109.3942 110.5082 111.4872 111.6705 113.7390 114.8090 116.2051 117.4400 119.5237 122.3864 123.4465 124.1010 127.0565 130.3459 132.5009 134.1861 147.0777 147.1841 147.5882 147.9214 148.2235 152.1568 153.0647 155.9175 157.8942 158.4059 165.2706 170.0334 172.2490 173.0896 178.2254 179.7239 181.1290 181.5070 181.8402 187.2707 189.4564 192.4811 192.5699 192.7829 193.2374 193.2669 194.4051 194.5092 194.6014 195.5697 195.8437 198.2806 199.7070 200.2245 200.9871 201.2836 201.5188 202.5196 203.7529 207.0633 231.6422 232.0991 233.2586 233.6460 241.9064 243.1203 244.3568 245.6857 248.7148 249.7891 613.5207 619.4324 647.6931 1202.6897 1203.2172 1562.9148 1567.6031 electronvolt
chargesum: -1.0000000
charge: -0.015211 0.074266 0.077253 0.223257 -0.546092 -0.491215 -0.283271 -0.259422 0.122218 0.098217
charge: -0.305514 -0.330014 0.131928 -0.694160 -0.096537 -0.056112 0.027624 0.075467 0.128006 0.119312
qa: -0.0152 0.0743 0.0773 0.2233 -0.5461 -0.4912 -0.2833 -0.2594 0.1222 0.0982
va: 3.8431 3.8314 0.9735 4.5760 1.8559 1.9518 0.9032 0.9473 0.9878 0.9651
energy: -466.348585208439
dipole: -2.86032 3.15517 0.29485 0.36436 -2.39387 -2.02951 -0.64328 0.10084 -0.54244
magnitude: 2.12134 au
magnitude: 5.39202 debye
temp: 298.15 k
press: 1.00 atm
zeropoint: 0.06362765 hartree
thermalvibcorrection: 0.00381306 hartree
thermalrotcorrection: 0.00141627 hartree
thermaltrasncorrection: 0.00141627 hartree
thermaltotal: -466.27831196 hartree
thermalcorr: 0.00664560 hartree
nonthermalcorr: 0.06362765 hartree
totalcorr: 0.07027325 hartree
thermalcorrenthalpy: 0.00094421 hartree
totalenthalpy: -466.27736775 hartree
totalentropycorr: -0.03875814 hartree
gibbsenthalpy: -466.31612589 hartree
gibbsminuselec: 0.03245932 hartree
