program: Gaussian 09
title: 000052818
version: EM64L-G09RevD.01
frameworkgroup: C1[X(C13H12N4O4)]
method: RPBEPBE
basis: SDD
operation: Freq
keyword: #p
keyword: freq=noraman
keyword: PBEPBE/SDD
title: #p freq=noraman PBEPBE/SDD
converged: YES YES NO NO
title: Mulliken charges:
elementType: O O O O N N N N C C C C C C C C C C C C C H H H H H H H H H H H H
charge: -0.211849 -0.160369 -0.213498 -0.206072 -0.271388 -0.012702 -0.435165 0.025324 0.305674 0.271929 -0.375710 0.503561 -0.029714 -0.661157 -0.398217 -0.360404 -0.388892 -0.390020 0.381376 0.233729 -0.783295 0.223909 0.230650 0.251272 0.258260 0.322840 0.229312 0.329180 0.287283 0.289729 0.273582 0.263193 0.217650
chargesum: 0.00000
title: Mulliken charges with hydrogens summed into heavy atoms:
elementType: O O O O N N N N C C C C C C C C C C C C C
charge: -0.211849 -0.160369 -0.213498 -0.206072 -0.271388 -0.012702 -0.112325 0.025324 0.305674 0.271929 -0.151801 0.503561 -0.029714 0.079024 -0.168905 -0.031224 -0.101608 -0.100291 0.381376 0.233729 -0.028870
polarizability: 4.56873096e+02 2.67509869e+00 1.88193278e+02 3.75642944e+00 -1.45955061e+00 8.54485432e+01
1716.lowfreq: -4.7420 -0.0006 0.0001 0.0004 3.8050 6.0523 19.7830 32.7026 43.5933
frequency: 19.6976 32.5808 43.5820 60.1572 65.1347 74.3479 76.4542 105.0719 120.0555 140.2759 145.8293 178.7168 203.7858 223.4217 237.4925 282.5646 289.9276 342.8410 352.8115 376.9760 407.0982 432.6273 442.1298 502.9533 511.3888 536.0532 551.7530 564.9217 577.0886 595.9050 630.4352 646.5963 669.8913 685.1126 723.6679 734.3632 746.7350 762.9794 781.7048 839.7272 841.2611 890.2541 903.5065 915.7359 922.1762 983.2285 989.7419 1004.6649 1022.2761 1033.9797 1041.4823 1093.9147 1099.4978 1117.3218 1121.9537 1165.8436 1187.3840 1195.8097 1223.7417 1227.8978 1289.6383 1313.7969 1327.5629 1360.4633 1379.3636 1383.9251 1416.0485 1430.9497 1439.2377 1451.1544 1466.7509 1473.4748 1476.1039 1481.3520 1498.8607 1521.5049 1575.6849 1597.1785 1615.7650 1647.9191 1682.7007 2978.6812 2990.3375 3059.0531 3076.2416 3082.3817 3102.7023 3129.4731 3133.6621 3135.5513 3181.4850 3184.7915 3533.1258
redmass: 8.0921 4.6248 6.7236 5.6228 4.6407 1.1100 5.1093 5.6718 5.6062 1.5192 3.2418 4.9154 8.0213 7.3069 5.9782 6.4879 2.9988 4.8398 4.1209 4.8390 3.6306 4.0844 6.8720 7.4376 3.3447 2.7674 1.7380 3.3398 5.5144 3.6440 7.2776 7.5718 4.7887 7.7137 7.1449 8.3822 4.5423 8.4035 9.0011 1.5022 4.1237 1.3177 4.0974 1.6171 3.6395 2.1187 1.3673 3.2341 4.0807 1.6946 1.3096 3.0793 4.4221 1.3142 1.3929 2.6130 2.2455 2.1737 2.5292 2.8942 3.0135 1.9951 2.3064 5.9514 3.5137 1.2286 3.0049 2.4237 1.2125 1.1473 1.2669 1.2720 1.1598 2.4442 1.1630 4.7195 7.6273 6.7680 7.0841 7.9100 8.0040 1.0359 1.0384 1.1018 1.0983 1.0859 1.0977 1.0902 1.0982 1.0955 1.0936 1.0948 1.0764
irintensity: 1.5117 4.7400 1.7379 2.3334 2.5067 0.8096 1.1585 0.5443 0.6769 1.5271 1.1865 1.0407 2.3530 0.2709 0.8238 0.3199 0.2779 2.7148 0.6638 10.7546 0.7021 1.6291 1.8068 4.9625 14.6716 66.7313 69.7826 6.1754 7.5812 38.4125 2.1440 1.9656 26.5297 14.9502 25.8862 75.7675 1.3734 7.0520 48.8318 7.6607 1.5694 4.7664 20.1622 78.6330 17.1218 162.2856 0.2056 0.6251 47.3857 15.0660 0.9848 38.5982 481.4819 3.6687 15.3679 7.1546 684.9326 94.3989 356.6082 16.5316 66.4690 43.1539 14.0819 94.8923 77.2038 64.0655 9.0462 44.6469 276.6911 10.5028 227.5078 311.5037 119.6526 65.2749 266.2082 376.3048 27.8997 43.3654 133.8137 9.6020 129.5070 49.2552 6.9488 17.5077 13.2969 19.4971 9.3164 12.0869 8.1015 33.7338 1.1733 1.2015 28.3344
temp: 298.150 k
press: 1.00000 atm
elementType: 8 8 8 8 7 7 7 7 6 6 6 6 6 6 6 6 6 6 6 6 6 1 1 1 1 1 1 1 1 1 1 1 1
symmnumber: 1
zpe: 628718.1 jmol-1
zpe.correction: 0.239466 hartree
zpe.thermalcorrener: 0.259004 hartree
zpe.thermalcorrenthalpy: 0.259948 hartree
zpe.thermalcorrgfe: 0.188850 hartree
zpe.sumelectzpe: -1020.895774 hartree
zpe.sumelectthermal: -1020.876236 hartree
zpe.sumelectthermalent: -1020.875292 hartree
zpe.sumelectthermalfe: -1020.946390 hartree
dipole: -8.7301 10.6847 -1.6004
dipole: 13.8903
quadrupole: -142.2300 -122.0226 -122.6463
quadrupole: -22.2794 10.4667 1.2962
quadrupole: -13.2637 6.9437 6.3200 -22.2794 10.4667 1.2962
hfenergy: -1021.1352399 hartree
pointgroup: C01 [X(C13H12N4O4)]
dipole: -3.6647118 3.7847587 1.452612 debye
polarizability: 455.8378551|15.4912933|165.760668|7.3847|43.4823281|108.9163943 unknown
InChI: InChI=1S/C13H12N4O4/c1-8(18)14-13-15-12(19)11(16(13)2)7-9-3-5-10(6-4-9)17(20)21/h3-7,14H,1-2H3
charge 0 multiplicity 1
33 atoms
O  -0.49844 -1.735805 -1.402307
O  -5.51914 -1.932355 -0.131543
O  6.567765 0.925369 0.348176
O  6.202594 -0.982368 -0.851307
N  -2.330651 0.831529 0.225542
N  -2.749896 -1.075114 -1.017467
N  -4.633952 0.248594 -0.25137
N  5.785561 0.055575 -0.204815
C  -1.038862 0.331584 -0.097372
C  -3.274275 -0.042068 -0.359487
C  0.116294 0.973195 0.302588
C  1.534125 0.661973 0.127527
C  -1.336137 -0.940929 -0.897936
C  -2.59969 1.961424 1.116605
C  2.463595 1.583976 0.71184
C  2.054808 -0.472253 -0.572881
C  3.848921 1.396619 0.610866
C  3.442135 -0.668569 -0.679321
C  4.324428 0.264148 -0.089169
C  -5.702341 -0.705648 -0.265316
C  -7.069716 -0.057888 -0.458334
H  -0.04389 1.906099 0.86443
H  -3.656293 1.947476 1.429007
H  -2.378813 2.930927 0.632022
H  -1.988918 1.877447 2.033819
H  -4.90438 1.234519 -0.235018
H  2.082796 2.458905 1.252646
H  1.359722 -1.185286 -1.026411
H  4.563805 2.094571 1.053596
H  3.852241 -1.530844 -1.211628
H  -7.845231 -0.746427 -0.092694
H  -7.245777 0.118511 -1.53582
H  -7.166486 0.909714 0.067335
