program: Orca
programVersion: 5.0.4
elementType: C H H C H C O O F H
charge: -1
multiplicity: 1
keywords: opt Freq M062X def2-TZVP TightSCF defgrid3
frequency: 0.00 0.00 0.00 0.00 0.00 0.00 54.61 234.20 250.86 296.22 399.60 508.01 666.68 784.77 850.49 927.62 1056.64 1126.09 1152.81 1308.32 1354.95 1377.87 1428.19 1484.05 1498.69 1752.29 3053.98 3078.59 3125.65 3166.74
frequency: 54.61 234.20 250.86 296.22 399.60 508.01 666.68 784.77 850.49 927.62 1056.64 1126.09 1152.81 1308.32 1354.95 1377.87 1428.19 1484.05 1498.69 1752.29 3053.98 3078.59 3125.65 3166.74
formula: C3H4FO2
InChI: InChI=1/C3H4FO2/c1-2(4)3(5)6/h2H,1H3
10 atoms
C  -2.469757 -0.793299 0.003268
H  -2.081726 -0.246479 -0.85462
H  -3.560493 -0.80301 -0.048562
C  -2.041537 -0.081536 1.270389
H  -0.952293 -0.072686 1.361291
C  -2.542363 1.389685 1.258824
O  -3.479405 1.680397 2.01246
O  -1.919466 2.084952 0.428238
F  -2.522798 -0.818701 2.356791
H  -2.106357 -1.823883 -0.018258
totalener: -367.08754900 hartree
nucrepener: 238.60810312 hartree
electener: -605.69565212 hartree
oneelecener: -987.30077585 hartree
twoeener: 381.60512372 hartree
kineticenergy: 365.74590885 hartree
xcener: -21.964423680369 hartree
energy: -681.7972 -527.0594 -527.0107 -283.9929 -283.7843 -282.5243 -31.6396 -26.0079 -23.5252 -19.1767 -15.4193 -12.0637 -11.4064 -10.3221 -9.6183 -8.8478 -8.4387 -7.8572 -7.6356 -7.3993 -6.3839 -3.4045 -3.3513 -3.0755 5.9440 6.8945 7.3584 7.8822 8.2098 8.9142 9.3214 9.7300 10.5740 11.0681 12.0152 12.6261 12.8247 13.5989 14.2974 14.6913 15.2659 15.8547 16.3931 16.6811 17.0847 17.5167 17.8863 18.5611 19.2598 19.8997 20.3268 21.0447 21.1980 21.7935 22.7959 23.0495 23.8930 24.6284 26.4677 26.6348 27.3152 28.4120 29.3494 29.6037 30.9252 30.9737 31.5989 33.5457 33.8162 34.3493 35.2708 36.5658 37.2346 37.3645 38.1561 42.0457 43.9795 44.3040 45.6917 46.3819 47.0691 47.3771 48.0123 48.8745 49.0928 50.1271 50.8501 52.0752 52.6490 54.6492 55.3974 55.5019 56.4121 57.9314 58.9388 60.4694 60.8043 61.8629 63.0514 63.3810 64.7920 64.9987 65.2988 66.0500 67.3091 67.8190 69.0446 69.5811 70.1588 70.4067 71.3581 71.6996 73.7368 74.3575 74.9901 76.7423 77.3208 79.2468 80.1876 81.5075 82.4227 83.1028 83.5675 85.0988 86.1010 87.1301 87.2374 87.6140 88.1031 89.2849 89.8308 90.6945 91.5582 92.7180 93.2301 93.4612 94.1735 95.3541 96.0798 97.0194 97.5128 98.3356 99.3912 100.0559 101.7273 102.1696 102.7942 104.1620 104.8950 106.6833 108.9160 110.3302 110.8506 111.3713 112.6014 114.1548 114.8616 117.0260 117.7281 122.3573 123.5644 124.2494 124.7635 127.3644 130.5019 132.9295 134.5245 147.4771 147.9290 148.3792 148.5456 151.7383 153.2877 156.3950 158.2886 158.6338 165.3325 170.3042 172.5971 173.3747 178.4528 180.1843 181.1624 181.8616 182.2260 187.6797 189.9158 193.0635 193.5577 193.5768 194.8299 195.7957 195.9859 198.5593 199.9129 200.9844 202.0908 203.6077 206.7570 233.1321 233.8304 244.0999 245.4828 250.0177 613.6164 618.6594 647.7874 1202.9719 1203.4601 1566.9056 electronvolt
chargesum: -1.0000000
charge: -0.436793 0.136221 0.128142 0.108476 0.060879 0.252364 -0.509600 -0.558923 -0.275155 0.094388
charge: -0.312199 0.127630 0.121379 -0.341263 0.122401 -0.698150 -0.070880 -0.105723 0.053643 0.103163
qa: -0.4368 0.1362 0.1281 0.1085 0.0609 0.2524 -0.5096 -0.5589 -0.2752 0.0944
va: 3.8200 0.9885 0.9715 3.8065 0.9692 4.5586 1.9314 1.8530 0.9192 0.9571
energy: -367.091613740778
dipole: 1.23856 -0.68181 0.55675 -3.45194 1.48461 -1.96733 -5.33148 4.93250 -0.39898
magnitude: 2.08316 au
magnitude: 5.29497 debye
temp: 298.15 k
press: 1.00 atm
zeropoint: 0.07048177 hartree
thermalvibcorrection: 0.00321470 hartree
thermalrotcorrection: 0.00141627 hartree
thermaltrasncorrection: 0.00141627 hartree
thermaltotal: -367.01508473 hartree
thermalcorr: 0.00604724 hartree
nonthermalcorr: 0.07048177 hartree
totalcorr: 0.07652901 hartree
thermalcorrenthalpy: 0.00094421 hartree
totalenthalpy: -367.01414052 hartree
totalentropycorr: -0.03671351 hartree
gibbsenthalpy: -367.05085403 hartree
gibbsminuselec: 0.04075971 hartree
