program: Gaussian 09
title: 000052801
version: EM64L-G09RevD.01
frameworkgroup: C1[X(C4H8N6)]
method: RPBEPBE
basis: SDD
operation: Freq
keyword: #p
keyword: freq=noraman
keyword: PBEPBE/SDD
title: #p freq=noraman PBEPBE/SDD
converged: YES YES NO NO
title: Mulliken charges:
elementType: N N N N N N C C C C H H H H H H H H
charge: -0.143073 -0.359441 -0.076506 -0.346236 -0.568159 -0.509869 0.256923 -0.010182 -0.311531 -0.261060 0.261455 0.234011 0.302967 0.334079 0.304013 0.303714 0.294538 0.294357
chargesum: 0.00000
title: Mulliken charges with hydrogens summed into heavy atoms:
elementType: N N N N N N C C C C
charge: -0.143073 -0.056474 -0.076506 -0.012156 0.039568 0.079025 0.256923 -0.010182 -0.050076 -0.027049
polarizability: 1.25823800e+02 3.91308998e-01 9.49841764e+01 3.60811858e-03 3.28813240e-02 4.43155563e+01
1716.lowfreq: -7.8792 -7.1186 -0.0009 -0.0008 -0.0003 5.8813 94.3329 109.6974 157.3650
frequency: 94.3099 109.6967 157.3639 180.4970 197.6969 233.7127 246.2307 318.1560 400.3952 440.3314 454.3085 485.4003 571.6561 593.4638 604.2189 650.0820 688.2991 762.9310 776.8663 811.3181 835.6896 915.3546 964.6978 992.2658 1062.2221 1188.4339 1195.9638 1226.0049 1267.0871 1289.0330 1289.9373 1339.4369 1379.3346 1410.7553 1476.5681 1511.6797 1560.9116 1563.6006 1665.9708 1685.1799 3134.1649 3207.3149 3382.6389 3455.9489 3472.2685 3492.7345 3582.7597 3605.4761
redmass: 3.6837 3.8462 4.0137 1.9510 1.8629 4.2495 3.7268 1.1461 1.2886 5.4159 3.2554 6.3423 1.0894 6.1610 1.0993 6.4393 4.4522 2.6984 5.4859 2.5345 1.4747 8.9538 1.3784 5.2339 1.5551 3.0453 4.0225 1.1825 2.1225 4.6250 1.1514 2.1815 2.0657 1.6748 2.5718 3.2788 4.5890 4.8584 1.1847 1.0631 1.0917 1.0949 1.0423 1.0747 1.0415 1.0988 1.0787 1.1066
irintensity: 7.4389 0.0407 0.0850 4.1334 19.2986 2.0372 12.4388 79.2202 250.5881 23.1707 0.2119 2.1885 181.3048 47.2479 84.3703 0.5397 0.0806 81.0038 0.8755 89.4944 59.0778 6.4114 0.0203 0.4462 0.0912 0.8939 21.6306 1.1549 12.4936 18.2327 0.0084 27.5247 87.5419 25.6349 239.5658 151.4709 452.6488 252.1690 68.5409 27.1526 28.1285 1.9452 2.4368 20.8297 3.9370 0.1899 74.2835 5.3687
temp: 298.150 k
press: 1.00000 atm
elementType: 7 7 7 7 7 7 6 6 6 6 1 1 1 1 1 1 1 1
symmnumber: 1
zpe: 370425.9 jmol-1
zpe.correction: 0.141088 hartree
zpe.thermalcorrener: 0.151006 hartree
zpe.thermalcorrenthalpy: 0.151951 hartree
zpe.thermalcorrgfe: 0.106201 hartree
zpe.sumelectzpe: -484.922544 hartree
zpe.sumelectthermal: -484.912625 hartree
zpe.sumelectthermalent: -484.911681 hartree
zpe.sumelectthermalfe: -484.957430 hartree
dipole: 4.2250 -2.7006 0.0252
dipole: 5.0144
quadrupole: -50.1081 -54.2371 -58.1187
quadrupole: -4.1150 0.0348 -0.0136
quadrupole: 4.0466 -0.0825 -3.9640 -4.1150 0.0348 -0.0136
hfenergy: -485.0636314 hartree
pointgroup: C01 [X(C4H8N6)]
dipole: -1.60738 -1.1419733 -0.0648792 debye
dipolederiv: -1.400072 -0.1046568 -0.0027558 -0.309472 -0.4659074 -0.0097334 -0.0129564 -0.0099815 -0.2635548 -0.41416 -0.5213782 -0.0253868 -0.6053489 -0.4685793 0.0068145 -0.0213428 0.0100087 -0.5106463 -1.0882432 0.0024141 0.0019675 0.6538055 -0.7432656 -0.0260786 0.0353349 -0.0250032 -0.2559542 -1.1687439 0.4650468 0.0253278 0.1982056 -0.0222413 0.0243928 0.0097016 0.0247419 -0.5028839 -0.0249711 0.0992099 0.0070515 -0.1632947 -0.7472155 -0.0427063 -0.0096561 -0.0432285 0.0147312 -0.585582 0.0720787 0.0043745 -0.0966712 0.0062554 0.0018362 -0.0034768 0.0008689 -0.0136409 1.2417121 0.3990855 0.0165459 0.9186004 1.1451446 0.0456626 0.0424583 0.0461469 0.1916321 1.8954033 -0.3693088 -0.022654 -0.3676225 0.5573855 0.0185249 -0.0221708 0.0185473 0.1970668 -0.4216379 -0.0443613 -0.0016328 -0.5318688 -0.7475243 -0.0256719 -0.0265386 -0.0261088 -0.2206457 1.0008261 0.1636046 0.0060979 -0.0021774 0.499536 0.0278569 -0.0022804 0.0277505 -0.0517043 -0.0187257 0.0659226 0.0035284 0.0555224 0.0948734 -0.0054158 0.0032335 -0.0053691 0.201578 0.0758957 0.0532896 0.0027387 0.0688117 -0.1223518 -0.0122553 0.0035427 -0.0122415 0.116463 0.0009869 0.0659164 0.0035429 0.0847335 0.1275548 -0.0118562 0.0018435 -0.0144577 0.3438668 0.2605106 0.0227067 0.0015117 0.064636 0.0763272 -0.0144106 0.0035188 -0.0141469 0.3537468 0.0241559 -0.0518818 0.0217416 -0.029649 0.3342943 0.0998921 0.0300004 0.0621177 0.1113231 0.021886 -0.0498661 -0.027429 -0.0263332 0.3478147 -0.072883 -0.0356385 -0.0359488 0.0940937 0.3005031 -0.142013 0.147587 0.038216 0.0610163 0.0323009 0.1073801 0.0263981 0.1006429 0.3002561 -0.1258089 -0.1621569 0.0499068 0.0668831 -0.0362698 -0.1029533 -0.0300941 0.0938857 unknown
polarizability: 125.7861878|1.147634|94.8946345|-0.0894291|2.5335776|44.4427103 unknown
InChI: InChI=1S/C4H8N6/c5-9-3-1-2-7-4(8-3)10-6/h1-2,9-10H,5-6H2
charge 0 multiplicity 1
18 atoms
N  0.355245 -0.685414 -0.121077
N  -1.890617 -1.269878 -0.144543
N  1.109971 1.650157 -0.005352
N  2.640301 -0.112758 -0.097596
N  -3.260441 -1.00968 -0.134749
N  3.067983 -1.457342 -0.168587
C  -0.944889 -0.252206 -0.096626
C  1.314652 0.288878 -0.074445
C  -1.284049 1.128729 -0.027474
C  -0.201424 2.029644 0.015876
H  -2.325229 1.450322 -0.01004
H  -0.380129 3.109738 0.070933
H  -1.518272 -2.22516 -0.196358
H  3.357497 0.610689 -0.062267
H  -3.759277 -1.259754 0.720831
H  -3.753859 -1.161386 -1.016434
H  2.73585 -1.989759 0.648625
H  2.734987 -1.90102 -1.036917
