program: Orca
programVersion: 5.0.4
elementType: C C C C C C C C C C C C C C C C C C C H H H H H H H H H H H H H H H H
charge: 0
multiplicity: 1
keywords: Freq RIJCOSX r2scan-3c CPCM(CH2Cl2)
frequency: 0.00 0.00 0.00 0.00 0.00 0.00 20.53 22.86 39.81 59.66 60.18 80.37 213.19 231.77 233.12 271.83 298.72 300.21 406.41 407.06 409.90 471.38 500.09 500.45 618.05 618.28 630.92 635.39 635.67 670.85 708.96 709.09 709.95 742.50 763.69 763.88 832.16 854.44 854.80 855.61 878.07 878.94 929.12 929.39 929.75 980.36 980.46 980.74 997.08 997.16 997.63 1020.87 1021.80 1021.95 1049.42 1050.67 1050.69 1099.30 1099.71 1104.11 1174.92 1175.46 1176.08 1190.51 1196.56 1196.96 1198.94 1208.27 1209.75 1275.58 1276.73 1332.25 1354.39 1355.27 1355.80 1361.60 1362.76 1470.56 1476.74 1477.05 1517.59 1517.99 1518.39 1613.55 1617.95 1618.23 1630.83 1631.19 1637.45 3016.24 3152.11 3153.03 3154.78 3162.99 3163.14 3164.42 3170.63 3170.71 3171.50 3177.25 3177.34 3178.07 3186.72 3186.79 3187.76
frequency: 20.53 22.86 39.81 59.66 60.18 80.37 213.19 231.77 233.12 271.83 298.72 300.21 406.41 407.06 409.90 471.38 500.09 500.45 618.05 618.28 630.92 635.39 635.67 670.85 708.96 709.09 709.95 742.50 763.69 763.88 832.16 854.44 854.80 855.61 878.07 878.94 929.12 929.39 929.75 980.36 980.46 980.74 997.08 997.16 997.63 1020.87 1021.80 1021.95 1049.42 1050.67 1050.69 1099.30 1099.71 1104.11 1174.92 1175.46 1176.08 1190.51 1196.56 1196.96 1198.94 1208.27 1209.75 1275.58 1276.73 1332.25 1354.39 1355.27 1355.80 1361.60 1362.76 1470.56 1476.74 1477.05 1517.59 1517.99 1518.39 1613.55 1617.95 1618.23 1630.83 1631.19 1637.45 3016.24 3152.11 3153.03 3154.78 3162.99 3163.14 3164.42 3170.63 3170.71 3171.50 3177.25 3177.34 3178.07 3186.72 3186.79 3187.76
formula: C19H16
InChI: InChI=1/C19H16/c1-4-10-16(11-5-1)19(17-12-6-2-7-13-17)18-14-8-3-9-15-18/h1-15,19H
35 atoms
C  -0.088564 -0.163212 0.770722
C  -0.751659 1.188601 0.546155
C  -1.45951 1.491547 -0.617367
C  -2.0113 2.758563 -0.802069
C  -1.866022 3.737416 0.176496
C  -1.164254 3.441439 1.344601
C  -0.612136 2.177818 1.524874
C  1.410266 -0.126474 0.503196
C  2.229281 -1.071146 1.130154
C  3.59796 -1.101249 0.885578
C  4.171115 -0.184529 0.004696
C  3.363932 0.759514 -0.622946
C  1.992327 0.789758 -0.373224
C  -0.78316 -1.285756 0.012512
C  -1.965589 -1.82139 0.53235
C  -2.653199 -2.822065 -0.146452
C  -2.168166 -3.30254 -1.362118
C  -0.991605 -2.775441 -1.886903
C  -0.302567 -1.775231 -1.202723
H  -0.206749 -0.392348 1.839392
H  -1.584158 0.732683 -1.385328
H  -2.559269 2.978005 -1.71451
H  -2.300487 4.723012 0.03418
H  -1.050498 4.196137 2.118198
H  -0.061606 1.951095 2.435889
H  1.783936 -1.790337 1.814837
H  4.22017 -1.838639 1.385671
H  5.240548 -0.204587 -0.185879
H  3.800954 1.480166 -1.308984
H  1.371754 1.534961 -0.863724
H  -2.348434 -1.447477 1.479985
H  -3.567239 -3.231054 0.275688
H  -2.702051 -4.085812 -1.89301
H  -0.603363 -3.145148 -2.832171
H  0.619444 -1.376478 -1.617764
elementType: C H
totalener: -733.47929134 hartree
nucrepener: 1286.86450490 hartree
electener: -2020.34379624 hartree
oneelecener: -3545.72273356 hartree
twoeener: 1525.37893732 hartree
cpcmener: -0.01107031 hartree
kineticenergy: 730.05577535 hartree
exchangeener: -104.614648565774 hartree
correlationener: -4.191043121805 hartree
xcener: -108.805691687579 hartree
chargesum: 0.0000000
charge: -0.054539 0.040897 -0.129640 -0.216708 -0.165697 -0.184898 -0.248248 0.042572 -0.249489 -0.185212 -0.165902 -0.215368 -0.130399 0.046417 -0.248777 -0.185574 -0.166601 -0.213659 -0.135655 0.198343 0.174613 0.168649 0.170281 0.168877 0.172926 0.172765 0.168930 0.170325 0.168747 0.175001 0.173179 0.168974 0.170452 0.168805 0.175612
charge: -0.150694 -0.078549 -0.159560 -0.168855 -0.177342 -0.168452 -0.157261 -0.078290 -0.156887 -0.168658 -0.177406 -0.168948 -0.159919 -0.078685 -0.157337 -0.168606 -0.177432 -0.168905 -0.159817 0.197276 0.186017 0.175986 0.175582 0.176337 0.180768 0.180845 0.176343 0.175587 0.176013 0.186035 0.180703 0.176369 0.175632 0.176060 0.186053
qa: -0.0545 0.0409 -0.1296 -0.2167 -0.1657 -0.1849 -0.2482 0.0426 -0.2495 -0.1852 -0.1659 -0.2154 -0.1304 0.0464 -0.2488 -0.1856 -0.1666 -0.2137 -0.1357 0.1983 0.1746 0.1686 0.1703 0.1689 0.1729 0.1728 0.1689 0.1703 0.1687 0.1750 0.1732 0.1690 0.1705 0.1688 0.1756
va: 3.3089 3.5084 3.7803 3.7791 3.7577 3.7617 3.8532 3.5100 3.8524 3.7603 3.7584 3.7781 3.7758 3.4976 3.8546 3.7617 3.7578 3.7791 3.7815 0.9568 0.9618 0.9627 0.9619 0.9624 0.9619 0.9620 0.9624 0.9619 0.9626 0.9616 0.9617 0.9624 0.9618 0.9626 0.9613
energy: -733.489343361318
dipole: 0.08540 -0.09265 -0.00725 0.13602 -0.15131 -0.01529 -0.67395 0.73701 0.06306
magnitude: 0.06529 au
magnitude: 0.16595 debye
temp: 298.15 k
press: 1.00 atm
zeropoint: 0.28894412 hartree
thermalvibcorrection: 0.01226923 hartree
thermalrotcorrection: 0.00141627 hartree
thermaltrasncorrection: 0.00141627 hartree
thermaltotal: -733.18529746 hartree
thermalcorr: 0.01510178 hartree
nonthermalcorr: 0.28894412 hartree
totalcorr: 0.30404590 hartree
thermalcorrenthalpy: 0.00094421 hartree
totalenthalpy: -733.18435325 hartree
totalentropycorr: -0.05752588 hartree
gibbsenthalpy: -733.24187913 hartree
gibbsminuselec: 0.24746423 hartree
