program: Orca
programVersion: 5.0.4
elementType: C C C C C C C C C C C C C C C C O C O C O C C C C C C C O C O C O C H H H H H H H H H H H H H H H H H H H H H H H H H H H H H H H H H H
charge: 0
multiplicity: 1
keywords: Opt RIJCOSX r2scan-3c
formula: C28H34O6
InChI: InChI=1/C28H34O6/c1-16-10-17(2)25(18(3)11-16)28(26-21(31-6)12-19(29-4)13-22(26)32-7)27-23(33-8)14-20(30-5)15-24(27)34-9/h10-15,28H,1-9H3
68 atoms
C  -0.548212 3.375273 0.320211
C  -0.657253 2.653949 -0.999881
C  -0.601665 1.248013 -1.080949
C  -0.726379 0.637484 -2.342284
C  -0.632046 -0.851151 -2.558273
C  -0.907337 1.437777 -3.473273
C  -0.964569 2.825798 -3.406578
C  -1.192949 3.657655 -4.640184
C  -0.827786 3.416672 -2.15503
C  -0.436755 0.492698 0.243508
C  -1.167151 -0.839187 0.350047
C  -0.572645 -2.102388 0.404591
C  -1.321995 -3.278806 0.551885
C  -2.706756 -3.184764 0.634407
C  -3.346693 -1.948625 0.577733
C  -2.571166 -0.801365 0.444176
O  -3.115396 0.448902 0.389505
C  -4.531222 0.567735 0.415464
O  -3.537678 -4.26257 0.77165
C  -2.941277 -5.550939 0.829479
O  0.782513 -2.135278 0.257892
C  1.45598 -3.379262 0.363251
C  0.966262 0.525096 0.832888
C  2.151671 0.508168 0.093554
C  3.414353 0.611323 0.694089
C  3.489222 0.705805 2.079311
C  2.336918 0.699056 2.862058
C  1.099787 0.608197 2.230678
O  -0.077209 0.600364 2.924872
C  -0.02146 0.709617 4.340643
O  4.66337 0.802501 2.775623
C  5.871511 0.818712 2.02815
O  2.014523 0.338879 -1.248626
C  3.130786 0.572556 -2.092454
H  -1.410724 3.157713 0.963973
H  -0.516978 4.456825 0.162924
H  0.349482 3.084486 0.876853
H  -1.527649 -1.374032 -2.205277
H  0.224678 -1.274391 -2.028252
H  -0.518007 -1.06503 -3.625619
H  -0.995596 0.951707 -4.443873
H  -0.838907 3.143068 -5.538798
H  -0.678517 4.621573 -4.572593
H  -2.260776 3.866923 -4.781738
H  -0.860393 4.501788 -2.069512
H  -1.004784 1.107994 0.947457
H  -0.82852 -4.238734 0.581571
H  -4.426042 -1.921925 0.647042
H  -4.991652 0.035671 -0.427385
H  -4.739268 1.635498 0.325453
H  -4.95067 0.192046 1.358792
H  -2.388663 -5.780505 -0.092243
H  -3.766121 -6.257525 0.939272
H  -2.267234 -5.644436 1.692341
H  2.518071 -3.144594 0.265359
H  1.280124 -3.853306 1.338633
H  1.161659 -4.070367 -0.439266
H  4.307314 0.594621 0.086479
H  2.443005 0.770551 3.936349
H  0.522176 -0.134177 4.786141
H  -1.058855 0.690447 4.679597
H  0.448375 1.652099 4.652952
H  6.675888 0.906205 2.760956
H  5.909905 1.677323 1.343436
H  6.003419 -0.109876 1.455353
H  2.740809 0.527173 -3.111758
H  3.906053 -0.197269 -1.96796
H  3.567003 1.564661 -1.914989
totalener: -1538.41347443 hartree
nucrepener: 3896.31796781 hartree
electener: -5434.73144224 hartree
oneelecener: -9851.29375340 hartree
twoeener: 4416.56231115 hartree
kineticenergy: 1531.48978080 hartree
exchangeener: -207.611725506369 hartree
correlationener: -8.140475055599 hartree
xcener: -215.752200561967 hartree
chargesum: -0.0000000
charge: -0.646287 0.030901 0.399955 0.128418 -0.675307 -0.357888 0.304595 -0.589938 -0.356661 -0.318669 -0.264603 0.474430 -0.595889 0.384744 -0.579350 0.313567 -0.145437 -0.342956 -0.177270 -0.346154 -0.137110 -0.357347 -0.043893 0.376462 -0.580522 0.396311 -0.550908 0.350062 -0.159626 -0.343474 -0.179060 -0.344693 -0.137509 -0.350288 0.177313 0.144391 0.185690 0.184430 0.207399 0.138675 0.145437 0.148199 0.148719 0.164318 0.144887 0.245790 0.144206 0.157547 0.156889 0.156629 0.151548 0.153342 0.154167 0.153101 0.159209 0.155949 0.151287 0.145015 0.157622 0.153906 0.155158 0.154570 0.153982 0.154416 0.150838 0.163273 0.143241 0.160252
charge: -0.390612 -0.074394 -0.029855 -0.062420 -0.378408 -0.179181 -0.102304 -0.396370 -0.176942 -0.086197 -0.026129 0.214425 -0.196665 0.204169 -0.161593 0.215225 -0.693792 -0.054882 -0.682399 -0.061384 -0.687053 -0.057767 -0.020146 0.220550 -0.196102 0.204182 -0.162489 0.211687 -0.698138 -0.055938 -0.683526 -0.061546 -0.680203 -0.056457 0.164748 0.155335 0.174005 0.174684 0.185719 0.152565 0.166106 0.157914 0.158629 0.162385 0.166324 0.229289 0.183249 0.189578 0.167379 0.179385 0.163851 0.163832 0.178155 0.163875 0.180896 0.165518 0.162451 0.183264 0.189074 0.165489 0.178661 0.165221 0.177941 0.164535 0.162731 0.182828 0.158596 0.168443
qa: -0.6463 0.0309 0.4000 0.1284 -0.6753 -0.3579 0.3046 -0.5899 -0.3567 -0.3187 -0.2646 0.4744 -0.5959 0.3847 -0.5794 0.3136 -0.1454 -0.3430 -0.1773 -0.3462 -0.1371 -0.3573 -0.0439 0.3765 -0.5805 0.3963 -0.5509 0.3501 -0.1596 -0.3435 -0.1791 -0.3447 -0.1375 -0.3503 0.1773 0.1444 0.1857 0.1844 0.2074 0.1387 0.1454 0.1482 0.1487 0.1643 0.1449 0.2458 0.1442 0.1575 0.1569 0.1566 0.1515 0.1533 0.1542 0.1531 0.1592 0.1559 0.1513 0.1450 0.1576 0.1539 0.1552 0.1546 0.1540 0.1544 0.1508 0.1633 0.1432 0.1603
va: 3.7317 3.5266 3.6698 3.4328 3.6393 3.9115 3.4456 3.7948 3.9358 3.3241 3.7904 3.6839 3.6968 3.9955 3.6803 3.7499 2.0563 3.7571 2.0182 3.7655 2.0140 3.7621 3.5287 3.9116 3.6500 3.9765 3.6586 3.6400 2.0431 3.7614 2.0180 3.7668 2.0265 3.7536 0.9505 0.9666 0.9488 0.9529 0.9473 0.9668 0.9728 0.9641 0.9631 0.9542 0.9733 0.9354 0.9746 0.9716 0.9535 0.9581 0.9527 0.9534 0.9586 0.9536 0.9587 0.9528 0.9526 0.9739 0.9715 0.9531 0.9582 0.9528 0.9586 0.9534 0.9539 0.9583 0.9531 0.9531
energy: -1538.410176201230
dipole: 3.24469 -2.46191 0.78277 1.21017 -2.10369 -0.89352 -7.30368 7.62565 0.32198
magnitude: 1.23077 au
magnitude: 3.12836 debye
