program: Orca
programVersion: 5.0.4
elementType: C Si C C H H H H H H H H H H
charge: 0
multiplicity: 1
keywords: Opt RIJCOSX r2scan-3c CPCM(CH2Cl2)
formula: C3H10Si
InChI: InChI=1/C3H10Si/c1-4(2)3/h4H,1-3H3
14 atoms
C  1.720881 0.113574 -0.460066
Si 0.099527 -0.032421 0.479944
C  -0.963451 1.490382 0.18813
C  -0.82383 -1.581748 -0.050037
H  2.274102 1.010192 -0.158854
H  2.361704 -0.756885 -0.280292
H  1.533486 0.178227 -1.538337
H  0.401689 -0.132153 1.941095
H  -1.199232 1.593654 -0.877576
H  -0.446914 2.401615 0.509814
H  -1.90879 1.424029 0.738244
H  -1.7605 -1.694017 0.507312
H  -0.219424 -2.480127 0.117981
H  -1.069147 -1.534222 -1.117557
totalener: -409.80069341 hartree
nucrepener: 174.86200930 hartree
electener: -584.66270270 hartree
oneelecener: -908.88137881 hartree
twoeener: 324.21867611 hartree
cpcmener: -0.00213804 hartree
kineticenergy: 408.15982306 hartree
exchangeener: -39.524543095430 hartree
correlationener: -1.345481473477 hartree
xcener: -40.870024568907 hartree
elementType: C Si H
energy: -1790.9199 -272.2250 -272.2246 -272.2244 -140.8960 -95.8029 -95.7564 -95.7562 -18.3507 -17.4285 -17.4277 -11.8923 -10.4039 -10.1157 -10.1154 -9.6543 -9.6529 -9.3976 -7.5738 -7.3861 -7.3858 1.6489 1.6512 2.4236 2.9831 3.4121 3.4138 3.4897 4.7468 4.7491 4.9178 5.1948 5.2009 5.9213 5.9282 6.1480 6.2008 6.4642 6.4644 6.7955 8.0543 8.0624 8.1076 9.3157 9.8327 9.8371 11.3695 11.3788 12.3312 14.9914 15.0039 15.0054 15.6705 17.7505 17.7507 27.4562 28.8136 28.8143 29.3307 29.3530 29.3604 29.9464 30.3938 31.2895 31.2912 33.3062 33.3159 35.1485 35.9379 35.9390 36.2174 36.5699 36.5833 36.6478 37.6285 37.6288 38.3914 38.4169 38.4197 38.5229 39.8878 39.9056 41.1848 42.2705 42.2838 44.9932 46.5275 46.5316 48.4771 49.2082 49.2237 51.3704 51.3923 51.3934 55.7905 55.7960 58.8997 60.1824 61.5363 61.7099 61.7136 62.1025 62.1029 63.0628 64.1926 64.1995 64.9823 65.3803 65.3827 67.9715 67.9791 70.0976 71.2922 71.9863 71.9880 75.3085 75.3104 75.4102 75.4801 75.4814 75.8384 86.8585 87.1794 87.1804 96.3847 96.4748 96.4771 96.8134 97.0118 97.0161 275.8364 596.4223 597.8474 597.8498 electronvolt
chargesum: -0.0000000
charge: -0.677151 0.619916 -0.677191 -0.677009 0.164848 0.164788 0.163993 -0.069302 0.163985 0.164899 0.164725 0.164794 0.164687 0.164017
charge: -0.626614 0.342729 -0.626605 -0.626553 0.170189 0.170204 0.169808 0.006532 0.169789 0.170193 0.170199 0.170180 0.170154 0.169795
qa: -0.6772 0.6199 -0.6772 -0.6770 0.1648 0.1648 0.1640 -0.0693 0.1640 0.1649 0.1647 0.1648 0.1647 0.1640
va: 3.7521 3.9846 3.7521 3.7523 0.9628 0.9629 0.9631 0.9843 0.9631 0.9628 0.9629 0.9629 0.9629 0.9631
energy: -409.797045745536
dipole: -0.28354 0.22046 -0.06308 0.09113 -0.07061 0.02051 -1.36372 1.05863 -0.30509
magnitude: 0.31221 au
magnitude: 0.79358 debye
