program: Gaussian 09
title: TEXT
version: ES64L-G09RevD.01
method: RB3LYP
basis: Gen
operation: Freq
keyword: #P
keyword: Geom=AllCheck
keyword: Guess=TCheck
keyword: SCRF=Check
keyword: GenChk
keyword: RB3LYP/ChkBas
keyword: Freq
converged: YES YES NO YES
title: Mulliken charges:
elementType: P C H C H C H H C H H C H H C H H C H H C H H C H H C H H C H H C H H C H H P C H C H C H H C H H C H H C H H C H H C H H C H H C H H C H H C H H C H H Ni C H H C H H C H H H C C C C H C H C H H H Te
charge: 0.328821 -0.192793 0.158305 -0.264581 0.180464 -0.277186 0.121490 0.167032 -0.260302 0.120555 0.128462 -0.265691 0.142071 0.118233 -0.383733 0.147798 0.146933 -0.280764 0.137474 0.138089 -0.227294 0.107751 0.126400 -0.221032 0.125504 0.101977 -0.243979 0.127415 0.114273 -0.223442 0.101437 0.127861 -0.221019 0.127382 0.101464 -0.231318 0.124059 0.110410 0.310446 -0.185138 0.158295 -0.203912 0.164039 -0.272939 0.113995 0.151326 -0.284999 0.147659 0.133077 -0.260812 0.139203 0.117080 -0.395974 0.150104 0.146135 -0.298475 0.145627 0.131170 -0.229759 0.107448 0.125654 -0.223609 0.125297 0.102888 -0.236019 0.126118 0.111856 -0.219351 0.102248 0.126317 -0.222367 0.126827 0.100707 -0.234080 0.126845 0.115931 -0.220253 -0.644730 0.180328 0.169658 -0.106564 0.128813 0.128104 -0.378683 0.115423 0.126462 0.113509 -0.314181 -0.137576 -0.133061 -0.094245 0.156622 -0.137520 0.168869 -0.131319 0.117101 0.117137 0.128688 0.370033
chargesum: 0.00000
title: Mulliken charges with hydrogens summed into heavy atoms:
elementType: P C C C C C C C C C C C C C P C C C C C C C C C C C C C Ni C C C C C C C C C Te
charge: 0.328821 -0.034488 -0.084116 0.011335 -0.011285 -0.005387 -0.089002 -0.005202 0.006857 0.006450 -0.002291 0.005855 0.007828 0.003151 0.310446 -0.026843 -0.039873 -0.007617 -0.004263 -0.004529 -0.099735 -0.021679 0.003344 0.004576 0.001955 0.009214 0.005168 0.008695 -0.220253 -0.294743 0.150353 -0.023289 -0.314181 0.019046 0.035808 0.022856 -0.020383 -0.002632 0.370033
polarizability: 6.24731963e+02 -1.35899713e+00 6.83999179e+02 -4.03134879e+01 4.28155079e+01 5.98227462e+02
1716.lowfreq: -5.8401 -5.4116 -0.0042 -0.0019 0.0006 5.3158 13.7896 17.5966 21.0231
redmass: 4.3715 4.3960 4.0052 4.3478 4.3093 4.6905 4.3331 3.6727 4.7460 3.7329 3.5885 3.1250 3.3829 4.1549 4.2126 2.0118 2.6112 2.9409 3.8455 4.7431 5.0082 3.1938 3.0947 4.1660 3.9865 3.4932 3.5678 3.9205 4.4208 4.8664 3.5691 3.4270 3.2065 2.8672 3.5264 4.4495 2.1102 2.3179 2.1817 1.1000 2.2352 2.1859 3.4942 3.4314 5.6089 1.9423 2.0319 2.0581 2.2124 3.5010 4.1659 4.1730 2.8575 2.7612 2.2890 3.0655 3.0555 2.8985 2.8207 2.7947 2.9287 2.7503 3.5468 2.9842 1.7367 1.8750 1.7330 1.8999 3.4154 2.6610 4.5694 6.4567 6.8309 1.8800 1.1342 2.5657 2.7719 2.6612 2.7026 1.6541 1.9071 1.4699 1.4699 1.4735 1.4728 3.2733 3.3414 3.2986 3.3191 1.2115 1.5587 1.8208 1.7856 1.7871 1.9162 1.2893 2.0081 2.0813 2.2266 2.2086 2.0914 2.0784 1.9928 2.0538 1.9526 1.3899 1.3867 1.4678 1.4799 1.3793 2.9050 1.3299 1.3645 3.2130 2.2474 2.3002 2.0893 2.0785 2.4605 1.6078 2.5923 1.9431 1.9454 1.9374 1.9441 1.8704 1.9102 1.6979 1.7066 1.9412 2.9851 3.0128 2.9319 2.9986 1.6906 1.0774 1.8998 1.0860 1.0972 1.1176 1.1231 1.5566 1.7170 2.0022 1.7945 1.3850 1.1322 1.2784 1.2742 1.4371 1.3313 1.3254 1.4006 1.1783 1.5058 1.3905 1.3822 1.4237 1.3351 1.2763 1.2821 1.2680 1.2643 1.2579 1.2561 1.2463 1.2350 1.2399 1.2712 1.2241 1.2125 4.6357 1.1822 1.1078 1.2279 1.2445 1.1964 1.1915 1.3970 1.3440 1.3250 1.3258 1.3521 1.3448 1.3269 1.3318 1.2851 1.2781 1.4459 1.4356 1.3936 1.4061 1.4542 1.4484 1.4598 1.4465 1.4221 1.4148 1.3925 1.3864 1.2218 1.1080 1.0788 2.0118 1.0946 1.0862 1.0857 1.0875 1.0885 1.0904 1.0904 1.0923 1.0879 1.0892 1.0804 1.0881 1.0554 1.0781 1.0872 1.0394 1.0880 1.0888 1.0923 1.0935 1.0973 1.0951 1.0966 1.9264 1.0966 5.2374 5.1148 1.0695 1.0707 1.0676 1.0706 1.0704 1.0704 1.0757 1.0720 1.0714 1.0648 1.0627 1.0625 1.0623 1.0616 1.0654 1.0703 1.0660 1.0660 1.0673 1.0665 1.0679 1.0512 1.0514 1.0715 1.0616 1.0750 1.0611 1.0968 1.0964 1.0950 1.0940 1.0932 1.0912 1.0899 1.0898 1.0677 1.1003 1.1012 1.1008 1.0984 1.1005 1.1012 1.1000 1.0659 1.0970 1.0939 1.0964 1.0959 1.0958 1.0955 1.1007 1.1020 1.1033 1.1014 1.1079 1.0855 1.0874 1.0909 1.0925 1.0977
irintensity: 0.0628 0.0436 0.0089 0.0480 0.0989 0.0691 0.0091 0.0612 0.0136 0.0183 0.0269 0.0348 0.0730 0.0176 0.0331 0.2650 0.0774 0.0292 0.3682 0.2174 0.6483 0.4061 0.9278 0.4700 0.2039 0.2630 0.3110 5.3019 2.0900 0.7046 8.6656 0.2050 4.1431 6.3061 20.1457 4.8415 1.1841 3.6194 0.7017 0.3994 0.5576 0.2168 5.2101 2.9954 20.2935 0.5720 1.1683 1.0355 4.1357 9.6358 6.1105 32.7099 1.7147 12.7975 0.5216 2.8175 2.3621 2.8430 2.6994 0.2041 33.2985 40.7807 11.7855 6.5534 14.7526 4.9250 20.0084 32.5595 2.7818 20.8774 67.7908 0.2297 2.3185 42.9770 23.6165 15.6074 1.5839 42.1450 35.9488 27.3811 55.0990 0.0942 0.2044 0.4387 0.3063 3.5206 4.7153 1.6688 0.8812 7.1009 9.2394 22.1145 5.2177 20.5721 2.0971 1.5054 5.6505 4.1371 1.7489 1.7721 4.5472 0.1235 0.3546 1.9594 20.0266 5.2878 2.4379 4.2297 3.6688 0.2897 0.1183 1.4225 4.0060 0.7505 8.8472 1.4923 20.9638 14.5102 4.0461 2.7796 12.5839 4.4301 2.8641 0.5049 0.0254 1.4013 1.9549 6.4138 3.1917 14.3417 0.5638 0.3471 0.8265 1.2302 3.2668 0.0713 30.9354 0.0300 2.8095 0.1024 6.6520 10.7577 7.2147 5.5117 13.8294 11.5820 0.1127 5.0049 3.1103 10.2616 24.6181 3.5220 19.1955 3.3066 8.9305 1.6226 3.9802 3.6428 0.4438 0.2347 0.2516 1.0847 1.5638 3.8723 3.9496 0.4641 4.1553 0.2466 4.2400 0.2407 0.3125 1.3362 1.8254 0.4830 2.5769 2.3805 3.9627 1.1895 4.4721 0.8412 0.8101 0.6407 0.7955 0.9116 0.2377 0.2006 1.1057 1.1286 5.2589 2.0686 3.7045 3.5342 0.0794 0.1049 0.2619 0.1178 1.3473 1.2061 0.3106 0.4370 2.2995 4.6953 5.0031 14.6982 6.5746 3.7603 1.5113 3.3810 1.2859 4.7765 7.3461 8.6853 0.2170 10.0834 6.0115 3.2474 14.2327 19.3882 3.8043 11.1262 7.7829 6.7290 2.4178 6.3882 1.2809 1.2063 2.4031 10.2579 0.5861 1.2538 7.3327 24.0260 23.4806 27.0540 32.4140 45.5829 18.9715 10.0659 34.3585 15.0651 34.7751 31.5861 38.9116 11.8987 19.5415 21.8713 2.5770 15.5216 4.9479 30.8460 1.6810 39.2289 19.7558 72.6254 27.5484 23.6181 25.9920 24.1071 70.3619 73.4250 32.7507 252.2318 7.3996 88.4785 63.9798 132.6409 54.8113 53.4474 106.1488 53.5124 2.6878 1.9633 79.7444 27.1894 18.7503 43.4816 49.6000 80.9064 55.8945 105.3326 64.6071 58.9797 4.2655 45.8665 33.2979 14.6115 2.1231 3.6323 27.4409 11.2722 56.4619
temp: 298.150 k
press: 1.00000 atm
elementType: 15 6 1 6 1 6 1 1 6 1 1 6 1 1 6 1 1 6 1 1 6 1 1 6 1 1 6 1 1 6 1 1 6 1 1 6 1 1 15 6 1 6 1 6 1 1 6 1 1 6 1 1 6 1 1 6 1 1 6 1 1 6 1 1 6 1 1 6 1 1 6 1 1 6 1 1 28 6 1 1 6 1 1 6 1 1 1 6 6 6 6 1 6 1 6 1 1 1 52
symmnumber: 1
zpe: 2334513.4 jmol-1
zpe.correction: 0.889169 hartree
zpe.thermalcorrener: 0.933269 hartree
zpe.thermalcorrenthalpy: 0.934213 hartree
zpe.thermalcorrgfe: 0.808209 hartree
zpe.sumelectzpe: -3568.873419 hartree
zpe.sumelectthermal: -3568.829319 hartree
zpe.sumelectthermalent: -3568.828375 hartree
zpe.sumelectthermalfe: -3568.954379 hartree
dipole: 0.5401 -2.3311 1.0216
dipole: 2.6018
quadrupole: -272.4234 -292.9130 -269.7982
quadrupole: -16.9134 6.2395 -5.3502
quadrupole: 5.9548 -14.5348 8.5800 -16.9134 6.2395 -5.3502
hfenergy: -3569.762588 hartree
pointgroup: C01 [X(C35H60Ni1P2Te1)]
dipole: 0.2125031 -0.9171398 0.401932 debye
polarizability: 624.7319626|-1.3589971|683.9991795|-40.3134879|42.8155079|598.2274623 unknown
InChI: InChI=1/35C.Ni.2P.Te.60H
charge 0 multiplicity 1
99 atoms
P  6.86305646 2.21118657 5.52084272
C  5.04783989 2.19281525 5.02517558
H  4.58353288 1.28350307 5.42449152
C  6.80488245 2.33334317 7.399529
H  6.38363614 3.32965571 7.56948074
C  8.23222343 2.3399541 7.9684834
H  8.69540884 1.36259566 7.79428427
H  8.84183057 3.0714906 7.43151962
C  4.94802718 2.17083988 3.4900126
H  5.51228923 3.02527523 3.09842987
H  5.4258595 1.27603104 3.08545613
C  5.92661018 1.32194617 8.14672629
H  4.90329149 1.34044084 7.76465467
H  6.30625777 0.30841046 7.98085678
C  7.37418922 0.41431254 5.20746645
H  7.0650426 -0.23501682 6.02927194
H  6.81492162 0.09160604 4.32785668
C  4.31475913 3.42201557 5.58634165
H  4.32659491 3.41316922 6.67835032
H  4.85396625 4.32438215 5.27573928
C  5.9218703 1.60867254 9.65534905
H  5.44204934 2.57865808 9.83196138
H  5.31662748 0.86061767 10.17620388
C  3.49747327 2.24638474 3.00262572
H  3.47620777 2.26164719 1.908771
H  2.96206851 1.3413946 3.31442282
C  8.23225303 2.62739773 9.47312886
H  9.25435316 2.59389345 9.86161269
H  7.86634135 3.64679709 9.64279457
C  2.86424505 3.50082591 5.09537048
H  2.29958453 2.65227148 5.50025712
H  2.39229044 4.40659398 5.48745771
C  7.34192959 1.63635829 10.22981853
H  7.3150469 1.8850315 11.29477725
H  7.77860082 0.63325069 10.15313095
C  2.78216014 3.47594929 3.56739289
H  1.73804715 3.49378274 3.24154399
H  3.25373349 4.38120442 3.16728907
P  9.56092837 1.72799368 3.92795552
C  11.37745258 1.72565224 4.43066613
H  11.73053282 0.68929877 4.4833578
C  9.57992486 1.07012926 2.16429595
H  10.09088537 1.86625875 1.61150087
C  8.14643843 0.99079089 1.61556981
H  7.58610971 0.23149674 2.17211007
H  7.63594437 1.94257315 1.78294603
C  11.49402642 2.36917192 5.8244512
H  11.00777 3.35050783 5.78654863
H  10.94248941 1.78391982 6.56335031
C  10.32952701 -0.24562585 1.91878927
H  11.35846698 -0.1805198 2.28039176
H  9.84966313 -1.05266295 2.48206426
C  8.88294775 0.28090792 4.94643967
H  9.11186811 -0.67813945 4.47707561
H  9.42562792 0.30166799 5.89307785
C  12.22967517 2.49608089 3.41007247
H  12.21697879 1.9917191 2.4417016
H  11.77887147 3.48228731 3.25280955
C  10.32426723 -0.61527407 0.42874129
H  10.89470058 0.13724763 -0.12842365
H  10.83636973 -1.57069216 0.27912955
C  12.94777516 2.53476913 6.27725963
H  12.97501293 3.03163535 7.25175879
H  13.40235656 1.54643501 6.41600132
C  8.13711513 0.62127387 0.1285063
H  7.1068494 0.53683169 -0.22988848
H  8.60310392 1.43184434 -0.4438129
C  13.68139387 2.66887324 3.87243024
H  14.16658147 1.68624633 3.91302479
H  14.23360806 3.25933303 3.13504681
C  8.89886147 -0.68293781 -0.12870842
H  8.92063462 -0.90657093 -1.19930051
H  8.36502566 -1.51085177 0.35363229
C  13.7631998 3.32558977 5.25207854
H  14.8056179 3.40764802 5.57342621
H  13.36998939 4.34715884 5.19087822
Ni 8.30420197 3.3982618 4.44119431
C  10.56940979 6.22483102 4.59599996
H  10.65472157 5.8230134 5.60519613
H  11.18978884 5.62027198 3.93500668
C  10.95457353 7.69360402 4.5422454
H  10.28369407 8.27534125 5.17991656
H  10.82601627 8.07235221 3.52374727
C  12.40085161 7.91419828 4.99408967
H  13.10365601 7.37488065 4.35297977
H  12.6669418 8.97422296 4.96213307
H  12.55161622 7.56434689 6.01905067
C  7.69308739 6.84345267 5.64200211
C  7.44606138 8.21376756 5.58379252
C  7.38988719 6.1416251 6.80575481
C  6.90556276 8.87562659 6.68539442
H  7.66867707 8.77029443 4.68086482
C  6.8583552 6.80207423 7.90920525
H  7.56666113 5.07310963 6.83282454
C  6.61403895 8.1718894 7.85016302
H  6.71211649 9.94095862 6.63182892
H  6.63033605 6.24802047 8.81289316
H  6.19392785 8.68774259 8.7055168
Te 8.52353824 5.75810272 3.95136031
