program: Gaussian 09
title: 000052940
version: EM64L-G09RevD.01
frameworkgroup: C1[X(C16H21NO2)]
method: RPBEPBE
basis: SDD
operation: Freq
keyword: #p
keyword: freq=noraman
keyword: PBEPBE/SDD
title: #p freq=noraman PBEPBE/SDD
converged: NO YES NO NO
title: Mulliken charges:
elementType: O O N C C C C C C C C C C C C C C C C H H H H H H H H H H H H H H H H H H H H H
charge: -0.262577 -0.249243 -0.056346 -0.202174 -0.125952 -0.215990 -0.282442 -0.503993 -0.499361 -0.481356 0.525224 -0.650485 0.198452 -0.456537 -0.406826 -0.226564 -0.249167 -0.247556 -0.507976 0.252411 0.227971 0.278752 0.257802 0.229516 0.212754 0.228915 0.251516 0.216714 0.229671 0.229289 0.196789 0.228690 0.240565 0.234499 0.223078 0.221444 0.225706 0.232823 0.245091 0.236872
chargesum: 0.00000
title: Mulliken charges with hydrogens summed into heavy atoms:
elementType: O O N C C C C C C C C C C C C C C C C
charge: -0.262577 -0.249243 -0.056346 0.050237 0.102018 0.062762 -0.024639 -0.061723 -0.018930 -0.034971 0.525224 0.004284 0.198452 -0.215972 -0.172327 -0.003485 -0.027723 -0.021850 0.206810
polarizability: 2.12626363e+02 3.27731515e+00 1.52504776e+02 1.26335191e+00 4.78522771e+00 1.59473320e+02
1716.lowfreq: -9.6870 -6.1605 -0.0004 -0.0001 0.0003 9.4718 25.2752 36.0165 49.0825
frequency: 25.1324 35.9318 48.9395 70.5873 93.8047 98.0348 113.0750 171.3256 178.9220 190.5287 202.3589 216.5274 233.5060 249.8403 275.9339 315.1398 330.2205 367.5655 391.3720 405.0562 476.8276 510.0056 521.0912 538.5843 615.1980 619.5639 662.7720 694.2442 706.2814 713.2473 743.2929 764.4587 773.6879 799.3522 831.9517 841.0703 852.1497 856.0046 887.5644 910.2618 919.8248 961.7397 968.6128 975.6606 987.1848 990.8659 992.6143 994.6755 1025.8642 1032.5528 1044.8445 1050.8177 1082.0168 1098.5146 1111.9851 1112.4769 1118.3891 1122.8862 1146.0484 1148.6207 1170.8040 1175.9701 1189.9986 1192.3804 1208.2335 1214.0796 1229.1605 1239.0991 1263.4541 1273.9621 1284.1930 1291.3906 1302.3290 1306.5245 1327.1443 1345.2217 1347.5996 1361.5375 1387.7555 1419.8511 1426.5503 1443.8862 1452.0755 1453.0542 1463.5367 1464.1105 1469.6455 1482.3230 1483.0824 1488.6321 1592.5268 1612.7782 1627.9303 2885.2898 2992.9415 3003.7105 3003.8870 3004.3841 3016.4454 3024.7334 3036.0404 3045.3336 3053.4359 3057.6629 3061.3012 3079.3830 3082.5283 3105.4857 3114.8506 3120.1610 3132.4517 3142.4973 3148.2805 3160.3708
redmass: 4.6714 3.8592 4.0350 4.1801 1.3425 2.8214 2.8719 2.9834 2.5175 2.3323 1.3449 4.5156 4.0731 3.5765 2.5590 4.1314 3.8480 2.3589 3.5186 2.8283 3.6453 3.7222 3.4663 3.0740 5.4662 5.1567 5.4045 4.9346 1.6879 4.4717 4.3884 2.0518 2.0784 2.6164 2.9431 2.5209 1.5733 2.4391 2.4703 3.4351 1.5130 2.5439 2.9370 1.3971 2.4598 5.1948 1.6932 2.0253 2.3078 2.1657 2.2010 2.0235 1.6165 1.7172 1.2868 2.1728 2.6478 1.8267 1.3956 1.4525 1.0760 1.7581 1.1334 1.3551 1.5205 2.1188 1.2998 1.4694 1.4473 1.4827 1.5300 1.5742 1.3560 1.4211 1.3991 1.4843 1.3697 1.5708 3.9693 1.1904 1.1698 2.0387 1.0506 1.1016 1.0545 1.0504 1.0718 1.0993 2.0823 1.0910 5.9086 6.0975 8.9727 1.0532 1.0613 1.0610 1.0298 1.0815 1.0642 1.0761 1.0859 1.0870 1.0894 1.0998 1.1003 1.1006 1.1043 1.1043 1.0853 1.0867 1.0917 1.0961 1.1048 1.1015
irintensity: 1.6933 0.3282 0.5062 0.8187 0.4348 1.7023 0.3334 2.1956 2.7591 4.4555 0.4346 1.5609 1.1221 3.8566 1.6964 16.2078 0.4615 0.4482 0.3527 0.0468 6.1589 2.0057 9.8873 10.8793 0.8140 2.6941 0.8841 13.9297 54.0785 8.7036 5.5057 41.5252 7.4827 0.5850 2.9187 3.1651 2.2750 2.2487 4.1964 3.3692 2.6407 1.3224 15.7183 0.2506 16.3009 0.5642 12.1849 12.3277 7.1996 10.0748 10.5276 6.5186 10.2588 4.3952 2.7308 24.3471 207.9973 36.9363 26.1049 16.2815 0.0360 1.3984 0.5246 4.3071 9.3316 1.8572 7.4225 36.5901 17.4883 7.5488 0.6357 51.8506 1.9935 2.5185 9.4508 17.6638 9.1088 4.1244 0.6504 20.0238 3.9661 9.2550 12.7131 7.9907 12.4058 11.7947 10.1904 5.7583 17.8556 31.4419 2.0885 9.1012 115.7066 114.1053 28.5922 16.1653 37.6609 6.0164 33.5651 48.9217 64.8872 19.2413 3.1126 19.5476 22.2828 31.5383 49.1575 25.0505 8.0118 0.3794 17.5243 40.0915 16.5528 26.0426
temp: 298.150 k
press: 1.00000 atm
elementType: 8 8 7 6 6 6 6 6 6 6 6 6 6 6 6 6 6 6 6 1 1 1 1 1 1 1 1 1 1 1 1 1 1 1 1 1 1 1 1 1
symmnumber: 1
zpe: 888105.2 jmol-1
zpe.correction: 0.338261 hartree
zpe.thermalcorrener: 0.356054 hartree
zpe.thermalcorrenthalpy: 0.356998 hartree
zpe.thermalcorrgfe: 0.291534 hartree
zpe.sumelectzpe: -826.061610 hartree
zpe.sumelectthermal: -826.043817 hartree
zpe.sumelectthermalent: -826.042873 hartree
zpe.sumelectthermalfe: -826.108337 hartree
dipole: -1.3650 0.4203 -0.6148
dipole: 1.5550
quadrupole: -102.2931 -106.1159 -114.8670
quadrupole: 2.3996 -0.9920 -3.2161
quadrupole: 5.4656 1.6428 -7.1084 2.3996 -0.9920 -3.2161
hfenergy: -826.3998713 hartree
pointgroup: C01 [X(C16H21N1O2)]
dipole: -0.5635482 0.0902172 -0.220299 debye
polarizability: 209.4614142|13.9115389|154.6820971|0.7858285|4.0767284|160.4609477 unknown
InChI: InChI=1S/C16H21NO2/c1-17-12-8-9-14(17)15(16(18)19-2)13(10-12)11-6-4-3-5-7-11/h3-7,12-15H,8-10H2,1-2H3
charge 0 multiplicity 1
40 atoms
O  -0.514344 2.846806 -0.547038
O  -0.252773 1.995939 1.602406
N  -2.494266 -1.111336 -1.000921
C  -2.289666 0.141295 -0.210797
C  -1.971846 -2.14816 -0.049441
C  -0.75659 0.468797 -0.288995
C  0.094353 -0.67025 0.361208
C  -0.428326 -2.066573 -0.090227
C  -2.758781 -0.198804 1.248613
C  -2.551232 -1.746703 1.355807
C  1.587631 -0.497338 0.079615
C  -3.898398 -1.326404 -1.421464
C  -0.468815 1.802279 0.381513
C  2.493864 -0.22806 1.135949
C  2.101072 -0.597122 -1.2408
C  3.876774 -0.072292 0.886245
C  3.480857 -0.440097 -1.495651
C  4.3764 -0.179519 -0.431503
C  -0.277737 4.204409 0.002128
H  -2.856642 0.97317 -0.664035
H  -2.30162 -3.151659 -0.372374
H  -0.519152 0.563241 -1.362336
H  -0.047117 -0.583589 1.455603
H  -0.106429 -2.274498 -1.126856
H  0.0183 -2.844074 0.559221
H  -3.821988 0.07075 1.378165
H  -2.182517 0.35919 2.006493
H  -1.859966 -2.020748 2.172501
H  -3.507601 -2.265271 1.546648
H  -4.200535 -0.511489 -2.103249
H  -4.6367 -1.367639 -0.584998
H  -3.964374 -2.276097 -1.981558
H  2.107847 -0.128094 2.157495
H  1.418896 -0.797949 -2.076383
H  4.560761 0.135317 1.717224
H  3.858995 -0.520709 -2.521409
H  5.44788 -0.059519 -0.628108
H  -0.348368 4.874186 -0.866265
H  0.721495 4.256649 0.465828
H  -1.040441 4.450867 0.760147
