program: Gaussian 09
title: TEXT
version: ES64L-G09RevD.01
method: RB3LYP
basis: Gen
operation: Freq
keyword: #P
keyword: Geom=AllCheck
keyword: Guess=TCheck
keyword: SCRF=Check
keyword: GenChk
keyword: RB3LYP/ChkBas
keyword: Freq
converged: YES YES NO NO
title: Mulliken charges:
elementType: Ni P C H C H C H H C H H C H H C H H C H H C H H C H H C H H C H H C H H C H H P C H C H C H H C H H C H H C H H C H H C H H C H H C H H C H H C H H C H H C C C C H C H C H H H C N K O C C C H H C H H C C H H H H C H H O H H H H H Te
charge: -0.355435 0.415068 -0.207022 0.169473 -0.268499 0.198712 -0.232097 0.116860 0.177110 -0.246184 0.122855 0.131493 -0.267634 0.145372 0.120807 -0.409154 0.181089 0.170024 -0.234757 0.146254 0.130940 -0.233452 0.115044 0.129328 -0.239205 0.131386 0.107563 -0.251735 0.161314 0.114254 -0.251224 0.107179 0.134811 -0.243593 0.133975 0.103997 -0.229270 0.130312 0.115265 0.440086 -0.217956 0.166060 -0.236548 0.206736 -0.276140 0.114937 0.168670 -0.187215 0.078464 0.121397 -0.258841 0.149236 0.118861 -0.406567 0.176612 0.176731 -0.263410 0.136451 0.155515 -0.232425 0.117878 0.131878 -0.255059 0.163523 0.098262 -0.247325 0.129176 0.125670 -0.228452 0.100526 0.131944 -0.224642 0.132758 0.101595 -0.245180 0.128245 0.124755 -0.161585 -0.155229 -0.032122 -0.096071 0.196788 -0.096031 0.137759 -0.195821 0.146134 0.113588 0.123935 -0.112541 -0.300029 0.765143 -0.400651 -0.691890 -0.083610 -0.043478 0.147815 0.172134 -0.102324 0.134451 0.121190 -0.088061 -0.137581 0.125157 0.133560 0.137449 0.116097 -0.397744 0.139985 0.103591 -0.282743 0.117723 0.154188 0.107953 0.110519 0.123410 -0.508494
chargesum: 0.00000
title: Mulliken charges with hydrogens summed into heavy atoms:
elementType: Ni P C C C C C C C C C C C C C P C C C C C C C C C C C C C C C C C C C C N K O C C C C C C C O Te
charge: -0.355435 0.415068 -0.037549 -0.069787 0.061873 0.008165 -0.001455 -0.058041 0.042437 0.010919 -0.000256 0.023832 -0.009235 -0.005621 0.016307 0.440086 -0.051896 -0.029812 0.007468 0.012647 0.009255 -0.053223 0.028556 0.017331 0.006726 0.007521 0.004018 0.009712 0.007821 -0.161585 0.041559 0.105638 0.050063 0.017557 -0.071886 -0.112541 -0.300029 0.765143 -0.400651 -0.371941 0.172032 0.215239 0.151221 0.155515 0.134331 -0.055862 -0.282743 -0.508494
chargesum: -0.00001
polarizability: 7.10488615e+02 -1.96948827e+01 6.86094852e+02 -1.43873252e+01 4.72054834e+01 7.15468168e+02
1716.lowfreq: -0.0038 -0.0019 0.0010 2.5536 6.0585 7.2003 16.1639 17.9325 18.9509
redmass: 5.9593 5.7784 6.6721 6.0417 5.2833 5.8406 4.8495 4.5908 3.6236 4.1831 4.1445 5.0097 4.3774 3.7101 5.3816 4.3002 4.0706 4.1488 4.2429 4.2034 4.0173 3.1796 4.6359 3.9783 2.7743 5.5809 4.8331 8.1982 2.1095 6.6096 6.0854 4.1734 3.3386 3.5316 2.7332 3.2984 6.7293 7.0353 3.5210 3.9626 3.8767 3.9279 2.9423 3.7569 4.0388 3.1625 2.4430 2.1473 1.1399 2.4631 2.2961 2.1185 1.9856 2.9367 2.4067 3.2831 3.0178 5.2719 2.2809 2.3566 2.8196 2.4020 2.2877 4.6341 3.8233 3.9594 2.9204 3.3393 6.5392 2.2904 2.8249 3.3173 3.1777 2.9926 4.3742 3.4555 3.3993 3.0456 2.7283 2.6445 2.8332 2.7033 4.1867 1.7263 1.7492 1.8579 2.2706 3.3881 1.6822 6.3735 2.6672 3.9479 6.7080 4.7802 1.1090 1.2575 2.5121 2.7145 2.7146 2.9107 1.4836 1.4855 1.8544 1.4747 1.5415 1.1957 3.2596 3.4217 3.0939 3.2500 4.0890 1.8752 1.8914 1.8034 1.6511 1.4162 1.6784 2.7189 1.8069 2.0844 2.0438 2.1057 2.5408 2.1727 2.1916 2.0075 2.1264 1.9900 1.7002 1.3755 1.4527 1.4258 1.4762 1.4772 1.1932 1.3724 2.6063 5.5523 1.3026 1.9415 2.0900 2.1195 2.1493 2.5366 2.2480 4.9555 1.9919 1.9917 1.9972 2.0140 1.8981 1.9577 2.2280 1.7371 1.7075 2.0502 2.1884 3.0002 2.3636 2.9371 1.9192 2.8416 4.2542 1.0796 1.0761 2.6167 1.0846 1.0782 3.6625 1.2026 1.8034 1.8872 2.0767 2.1019 1.7015 1.4005 1.1247 1.2867 1.2873 1.2744 1.2772 1.2598 1.2793 1.4034 1.3856 1.4021 1.3360 1.3344 1.0744 4.9621 1.3305 1.1440 1.3002 1.2819 1.2637 1.2587 1.2348 1.2362 1.2442 1.2238 1.2559 1.2658 1.2381 1.2215 1.1078 1.2302 1.1972 1.2088 1.2151 1.1617 1.1885 1.1756 1.3861 1.3739 1.3348 1.3359 1.3531 1.3457 1.3060 1.2054 1.3139 1.2693 1.3001 1.4069 1.4457 1.4436 1.3826 1.4083 1.4433 1.3820 1.4466 1.4013 1.4033 1.3731 1.3548 1.2635 1.2377 1.2834 1.3773 1.9427 1.0780 1.0864 1.0901 1.0878 1.0794 1.0876 1.0877 1.0894 1.0880 1.0865 1.0853 1.0873 1.0877 1.0792 1.0787 1.0845 1.0876 1.0530 1.0896 1.0958 1.0905 1.1020 1.1001 1.1409 1.1083 1.3714 1.1088 1.2012 1.0932 1.1019 1.1004 4.5996 4.9097 12.8025 1.0703 1.0699 1.0697 1.0793 1.0696 1.0698 1.0811 1.0697 1.0658 1.0694 1.0677 1.0644 1.0663 1.0625 1.0664 1.0594 1.0619 1.0406 1.0624 1.0628 1.0639 1.0663 1.0615 1.0644 1.0637 1.0784 1.0685 1.0758 1.0797 1.0999 1.0822 1.0867 1.0920 1.0813 1.0980 1.0911 1.0966 1.0992 1.0982 1.0587 1.0939 1.0678 1.0804 1.0776 1.0925 1.0882 1.0950 1.0973 1.1005 1.0943 1.1014 1.1006 1.1009 1.0999 1.1021 1.0974 1.0966 1.1004 1.1027 1.1009 1.0990 1.1042 1.1013 1.0854 1.0864 1.0916 1.0910 1.0968
irintensity: 1.6165 0.8965 0.1616 1.6583 3.1033 1.6556 1.7564 0.1526 0.3224 0.3434 1.4114 1.1704 1.5896 0.3123 2.7656 1.4116 0.4784 0.4359 2.0853 3.0159 1.9063 1.6816 0.6536 0.6473 0.0073 1.7678 3.2734 13.4098 0.6816 9.1223 0.7636 0.8665 0.4060 0.3547 0.1135 0.0658 17.1978 16.3475 3.0103 6.2373 0.3848 0.7711 0.2828 2.0102 1.0086 0.7520 1.3136 1.3456 0.1799 0.8383 2.3508 1.4718 2.5787 0.6906 1.9451 0.6759 32.8313 4.3857 0.9713 0.0615 0.8508 1.3384 1.9903 3.0649 3.9032 8.1962 0.6737 2.7764 5.5705 0.2228 2.1022 1.0499 0.8190 1.5213 1.1788 3.0391 4.5667 0.5528 7.8915 9.3941 14.6236 0.2337 7.2038 7.7027 3.2372 0.4558 31.2403 4.4362 17.1908 0.1634 32.2134 24.3797 1.4848 2.4314 23.7839 97.0098 30.5631 7.8932 8.8899 15.6255 1.5815 2.5593 31.8056 1.6660 0.3583 0.5712 1.2957 2.4155 0.6077 1.1990 2.1395 9.4006 20.6260 9.7058 5.2804 5.4936 8.6176 83.1903 3.4807 6.3816 0.4167 3.1720 33.5263 1.4929 0.0660 8.6664 1.8717 1.8084 6.5503 11.3362 5.3653 1.9181 6.0439 5.4234 0.4312 1.1476 0.5037 0.9561 3.0348 1.8581 3.8169 1.4791 21.5230 6.6440 12.4675 23.9693 0.9667 1.0531 0.4436 0.5916 1.8516 2.0881 11.6931 3.9359 2.6276 1.8026 2.1811 0.4097 2.0566 2.0521 12.0317 0.7330 101.9540 0.1993 0.6973 24.3626 4.7583 0.7856 96.1613 10.1548 7.5820 1.8559 6.6344 0.6694 14.1348 1.3377 0.4781 37.6062 16.9779 9.9439 10.7392 6.4880 2.5581 19.8507 8.5577 1.1445 2.8046 3.0264 0.2534 3.3317 1.4379 27.3081 1.6923 0.4079 0.6614 1.8999 2.8066 6.8167 1.4976 3.4925 5.6141 6.6933 0.2006 2.7571 0.7447 22.6339 0.2921 2.8435 6.9114 0.5747 2.9351 4.0607 0.1920 0.3492 1.7395 1.7671 0.6876 1.7854 0.8565 0.5435 0.1655 0.9180 4.6371 2.4553 0.0749 0.0976 1.5904 4.8696 1.1202 4.1655 0.2639 1.7744 0.2453 0.1579 0.2979 12.4798 8.7907 1.7388 0.8791 5.8522 6.0700 2.9925 7.8248 2.0025 1.8737 1.0712 1.1852 2.1295 6.9873 4.8482 5.4604 4.0413 2.5601 6.4411 1.7830 6.8542 47.8419 8.6579 16.4182 5.9859 3.3808 5.7759 19.7536 3.5671 4.8421 11.5843 6.5138 1.1125 2.5379 1.2686 2.9203 1.6817 34.3727 83.4317 32.0860 28.3494 40.2341 5.3113 34.1969 24.9417 44.4903 14.7170 32.4792 69.2118 42.8518 29.9619 36.5169 42.7081 5.9573 98.3600 25.4087 62.2058 50.9068 7.3959 11.1734 27.2214 12.7902 35.6057 13.6299 12.0838 17.9534 31.6599 8.9833 4.2238 39.3726 99.5609 67.0413 76.8780 66.5163 123.9365 45.1197 106.5318 85.0007 27.8681 24.6612 14.1698 28.9859 8.2398 46.0072 17.5982 41.8602 54.4570 70.1618 6.2255 41.4994 55.1742 17.1493 92.3283 4.4413 34.2080 44.7498 29.7791 1.0379 16.0571 29.0692 34.7214 11.4917 3.1635 0.1468 25.2348 21.0768 30.2533
temp: 298.150 k
press: 1.00000 atm
elementType: 28 15 6 1 6 1 6 1 1 6 1 1 6 1 1 6 1 1 6 1 1 6 1 1 6 1 1 6 1 1 6 1 1 6 1 1 6 1 1 15 6 1 6 1 6 1 1 6 1 1 6 1 1 6 1 1 6 1 1 6 1 1 6 1 1 6 1 1 6 1 1 6 1 1 6 1 1 6 6 6 6 1 6 1 6 1 1 1 6 7 19 8 6 6 6 1 1 6 1 1 6 6 1 1 1 1 6 1 1 8 1 1 1 1 1 52
symmnumber: 1
zpe: 2689101.8 jmol-1
zpe.correction: 1.024225 hartree
zpe.thermalcorrener: 1.079677 hartree
zpe.thermalcorrenthalpy: 1.080621 hartree
zpe.thermalcorrgfe: 0.928948 hartree
zpe.sumelectzpe: -4569.489171 hartree
zpe.sumelectthermal: -4569.433718 hartree
zpe.sumelectthermalent: -4569.432774 hartree
zpe.sumelectthermalfe: -4569.584447 hartree
dipole: -6.5736 -8.4420 -5.6602
dipole: 12.1045
quadrupole: -481.0912 -420.2676 -389.7486
quadrupole: -135.2139 -87.4809 -66.3841
quadrupole: -50.7221 10.1016 40.6205 -135.2139 -87.4809 -66.3841
hfenergy: -4570.5133955 hartree
pointgroup: C01 [X(C40H68K1N1Ni1O2P2Te1)]
dipole: -2.5862699 -3.3213404 -2.2268992 debye
polarizability: 710.4886154|-19.6948827|686.0948517|-14.3873252|47.2054834|715.4681685 unknown
InChI: InChI=1/40C.K.N.Ni.2O.2P.Te.68H
charge 0 multiplicity 1
116 atoms
Ni 8.88460889 5.71298271 1.41458407
P  8.09726473 4.05195319 2.66845611
C  6.26759812 3.6670591 2.54602142
H  6.16990662 2.62562537 2.87525808
C  8.46661712 4.16781455 4.49357618
H  7.84718692 5.00946491 4.816488
C  9.93320954 4.54665259 4.74966431
H  10.58366085 3.73629982 4.4037207
H  10.21169319 5.43946073 4.18676004
C  5.80971453 3.75854152 1.07909327
H  5.98391221 4.77685345 0.722029
H  6.40564577 3.09823209 0.44581691
C  8.06817866 2.93075949 5.3131664
H  7.01958577 2.67137675 5.15120102
H  8.66151298 2.06904792 4.99023332
C  8.87337165 2.45600048 2.06323867
H  8.85533621 1.7034244 2.85275473
H  8.22433594 2.09157986 1.2660843
C  5.38507561 4.54585704 3.44950016
H  5.67559671 4.43960212 4.49581478
H  5.52513641 5.59570742 3.18807185
C  8.32250635 3.16591765 6.8086787
H  7.66074745 3.96487465 7.16224014
H  8.05771515 2.26646191 7.37197275
C  4.32464923 3.41176737 0.9286561
H  4.02685177 3.5266757 -0.1174272
H  4.17117929 2.3565867 1.18488401
C  10.18350568 4.77700756 6.24254766
H  11.23262796 5.03431369 6.40111977
H  9.6021235 5.64543231 6.56881379
C  3.90385924 4.18176538 3.29180914
H  3.73911697 3.15877945 3.65130634
H  3.3004982 4.83813123 3.924696
C  9.7785609 3.55912148 7.07607863
H  9.92562428 3.76159693 8.14043029
H  10.43132704 2.7141124 6.82498971
C  3.45154534 4.28406149 1.83345488
H  2.40091387 3.9958257 1.73930437
H  3.52496523 5.3277539 1.50813601
P  10.42806749 4.28971567 0.60355388
C  12.23349018 4.74964734 0.76991459
H  12.79804848 3.82588207 0.59452137
C  10.15210881 3.91166033 -1.20060395
H  10.35166765 4.87596784 -1.6791385
C  8.67941323 3.56476735 -1.4716603
H  8.42528335 2.62623289 -0.96672102
H  8.03354447 4.33970736 -1.05184261
C  12.50328628 5.23802017 2.2035401
H  11.85010011 6.08577135 2.42945393
H  12.25801155 4.46117665 2.9294559
C  11.08899381 2.85816403 -1.80678157
H  12.13454079 3.12401273 -1.63706291
H  10.92401165 1.8921866 -1.31704428
C  10.29276485 2.67410632 1.53532357
H  10.6146898 1.84079544 0.90863357
H  11.00013695 2.74067342 2.36248597
C  12.67302379 5.8024808 -0.2619332
H  12.54574243 5.42370728 -1.27828628
H  12.03523011 6.68413286 -0.17540838
C  10.82803787 2.70221239 -3.31123609
H  11.0948915 3.6364514 -3.81779803
H  11.48009612 1.92566208 -3.7208484
C  13.95692694 5.67362762 2.40392363
H  14.06951059 6.06493669 3.41748025
H  14.61797595 4.80233153 2.31674321
C  8.42111955 3.40771919 -2.97364712
H  7.37762942 3.12766871 -3.14346943
H  8.57032716 4.37696317 -3.46226105
C  14.13353812 6.21801921 -0.04804128
H  14.7893915 5.35972638 -0.23968123
H  14.39990141 6.98577561 -0.78011714
C  9.36029869 2.37117259 -3.59802204
H  9.1913811 2.30863332 -4.67645906
H  9.12836062 1.3812916 -3.18656216
C  14.36919996 6.72707595 1.37545048
H  15.41786775 7.00435997 1.51339443
H  13.778249 7.63514226 1.54079923
C  7.59637461 6.95842478 2.17074918
C  7.73783651 7.44057018 3.48160838
C  6.52156242 7.46237588 1.42221661
C  6.83174398 8.35033243 4.03047406
H  8.57419075 7.11529102 4.08801357
C  5.60717318 8.3631509 1.96485836
H  6.39864257 7.15311058 0.39052972
C  5.75358268 8.80691171 3.27797629
H  6.96963876 8.69453261 5.04927567
H  4.78094919 8.72228338 1.3603682
H  5.04065881 9.50231276 3.70533506
C  9.3957906 7.05484158 0.20582305
N  9.683154 7.92073683 -0.51733642
K  9.91440018 9.61353405 1.84495842
O  9.06242695 11.92822976 2.99796507
C  10.07488994 8.80083199 5.94228599
C  7.96705963 12.78492019 2.64781732
C  9.60522421 12.28194617 4.28557534
H  9.29222608 9.29574493 5.36793821
H  9.70477268 7.80827995 6.19934974
C  10.36958701 9.58710684 7.21447829
H  7.57122902 12.42834005 1.69502383
H  8.33426295 13.8105952 2.51590206
C  6.89560582 12.74593781 3.72230462
C  8.51760192 12.24879817 5.34107021
H  10.04709137 13.28388898 4.22538123
H  10.39350686 11.55986883 4.5071602
H  11.19327517 9.11045658 7.75320837
H  10.72399215 10.58915642 6.95323462
C  9.14910188 9.6899435 8.13525806
H  6.09893709 13.45531472 3.49251028
H  6.46501741 11.7368121 3.77484995
O  7.43436957 13.11567672 4.99063173
H  8.14600016 11.22375516 5.45758529
H  8.90565736 12.59231127 6.3000594
H  8.30462764 10.16981116 7.63233314
H  8.81730655 8.69879554 8.45885016
H  9.37216399 10.27314587 9.03355905
Te 11.81188438 8.50793726 4.61046724
