program: Gaussian 09
title: 000052796
version: EM64L-G09RevD.01
frameworkgroup: C1[X(C5H10N6)]
method: RPBEPBE
basis: SDD
operation: Freq
keyword: #pfreq=noraman
keyword: PBEPBE/SDD
title: #p freq=noraman PBEPBE/SDD
converged: YES YES NO NO
title: Mulliken charges:
elementType: N N N N N N C C C C C H H H H H H H H H H
charge: -0.115017 -0.121176 -0.366379 -0.351396 -0.566697 -0.508087 0.256037 0.250898 -0.432188 -0.064072 -0.777797 0.264906 0.228016 0.246919 0.227882 0.304589 0.327703 0.302132 0.301631 0.296055 0.296040
chargesum: 0.00000
title: Mulliken charges with hydrogens summed into heavy atoms:
elementType: N N N N N N C C C C C
charge: -0.115017 -0.121176 -0.061790 -0.023693 0.037067 0.084009 0.256037 0.250898 -0.167282 -0.064072 -0.074981
polarizability: 1.43552637e+02 9.49022050e-01 1.07030146e+02 1.64434304e-02 5.69121030e-02 5.40540403e+01
1716.lowfreq: -85.5689 -4.9932 0.0007 0.0007 0.0008 5.8857 6.1159 76.7961 118.1396
frequency: -85.5415 76.7921 118.1305 163.0578 164.7576 178.8547 197.9602 214.1497 233.3868 326.4993 357.5545 382.4786 428.1117 508.8780 540.3461 553.1347 590.3055 610.2545 656.2964 679.0944 682.4692 775.6929 815.5999 866.8659 908.5887 947.1861 995.1022 1043.5135 1046.0748 1140.2171 1209.3870 1227.5094 1229.3709 1294.0989 1299.8491 1316.3525 1382.4012 1408.8752 1420.2937 1441.7808 1466.6092 1468.1644 1525.2719 1556.9493 1567.2671 1667.7246 1689.5169 2985.9982 3065.9839 3115.8257 3195.1870 3380.2607 3459.4176 3468.6494 3487.2986 3585.9199 3599.2721
redmass: 1.0222 3.9516 3.8699 2.6941 3.9550 1.3467 3.2459 3.5967 5.5302 1.1359 2.7147 3.9435 1.4273 6.7104 5.7862 1.1332 3.3813 1.0887 5.1354 4.6770 4.4920 5.9092 1.9141 1.4083 5.1943 3.3015 2.1504 3.0744 1.5923 2.0826 3.6326 2.8542 1.2100 1.1485 3.3538 2.8510 1.2267 2.9327 2.4211 1.8677 1.3116 1.0467 3.3722 4.3752 5.1586 1.1790 1.0624 1.0376 1.0972 1.0986 1.0928 1.0427 1.0693 1.0467 1.0981 1.0786 1.1064
irintensity: 0.3912 9.3451 2.3446 0.7352 6.3428 8.8734 1.1092 3.7014 15.4031 71.8002 8.4548 12.0639 256.7004 5.4507 12.3305 172.9739 1.2628 95.6074 38.0094 11.1891 0.1401 1.5038 154.6700 36.3561 17.4069 5.2299 0.3837 1.4240 9.8515 13.4419 5.3938 3.9507 1.1702 0.0397 18.8604 5.3980 18.4676 296.7695 10.0405 11.9668 124.5638 15.1689 112.4114 406.0278 444.7076 67.8801 33.3841 18.9400 20.0143 12.9153 0.5675 1.9333 15.7161 10.9695 0.2394 65.2793 4.5122
temp: 298.150 k
press: 1.00000 atm
elementType: 7 7 7 7 7 7 6 6 6 6 6 1 1 1 1 1 1 1 1 1 1
symmnumber: 1
zpe: 440923.1 jmol-1
zpe.correction: 0.167939 hartree
zpe.thermalcorrener: 0.178918 hartree
zpe.thermalcorrenthalpy: 0.179862 hartree
zpe.thermalcorrgfe: 0.131651 hartree
zpe.sumelectzpe: -524.155679 hartree
zpe.sumelectthermal: -524.144700 hartree
zpe.sumelectthermalent: -524.143756 hartree
zpe.sumelectthermalfe: -524.191967 hartree
dipole: 3.8770 0.0529 0.0379
dipole: 3.8776
quadrupole: -51.3656 -61.2124 -64.2839
quadrupole: -7.3467 0.1358 -0.0330
quadrupole: 7.5884 -2.2584 -5.3299 -7.3467 0.1358 -0.0330
hfenergy: -524.3236173 hartree
pointgroup: C01 [X(C5H10N6)]
dipole: -1.5228649 -0.0076423 -0.0901195 debye
dipolederiv: -0.8498467 0.0408321 -0.0298185 0.6747797 -1.0117829 0.0319883 -0.0287975 0.0016845 -0.2406615 -1.5766842 0.0905243 -0.0636936 0.0058834 -0.5059476 -0.0004102 -0.0646443 0.0035844 -0.2806585 -0.729887 -0.4965946 -0.0069527 -0.5177301 -0.2164461 -0.0208759 0.0089082 -0.0158942 -0.5129778 -0.8570124 0.4024509 -0.0191194 0.8409173 -0.3534678 0.0435254 -0.0218437 0.0261493 -0.5091141 -0.087086 -0.0835044 -0.0040801 -0.354543 -0.689114 -0.0238087 -0.0117033 -0.0095371 0.021391 -0.2138378 0.1866613 -0.0073161 0.3934088 -0.3300985 0.0164529 -0.0044105 0.0063635 -0.0205423 0.9857085 0.0898917 0.04637 -0.0991111 0.8740399 -0.0042998 0.0462105 0.0047044 0.031878 1.6175125 0.3387629 0.068373 0.7272932 0.9350682 0.0370453 0.0680414 0.017058 0.194056 -0.6045521 -0.2232965 -0.0181614 -0.5258924 -0.7656432 -0.0263248 -0.0179201 -0.0107603 -0.2403409 1.5995876 -0.4609767 0.0694367 -0.8756655 0.9434109 -0.0425123 0.06841 -0.0230633 0.1997782 0.0531598 0.0492706 0.0004712 -0.0242687 -0.317139 -0.0015024 0.0002643 0.0017537 0.045903 0.0315145 0.0873738 -0.0075431 0.0884939 0.0543786 0.004279 -0.0074146 0.0042238 0.1908605 0.0411093 0.0370343 0.1057729 0.0084016 0.0154805 -0.0511964 0.0805551 -0.1031338 -0.0342018 -0.088681 -0.1134309 -0.0096156 -0.0124596 0.0882745 -0.0005994 -0.0095669 -0.0052736 0.1132529 0.0578637 0.027204 -0.0971441 0.0035787 0.0154127 0.0517141 -0.0718907 0.1063644 -0.0510447 0.0512682 0.0826165 -0.0160521 0.1051622 0.0874693 0.0038379 -0.0209634 -0.0008675 0.345132 0.1004311 -0.058368 -0.0118353 -0.1137803 0.1967548 -0.0065735 -0.0088414 -0.0064406 0.3529955 0.0154833 0.0294074 0.0438965 0.0536276 0.3380931 0.0812973 0.0433666 0.0416516 0.1058076 0.0227203 0.0334241 -0.0524004 0.0639269 0.3381764 -0.0723567 -0.0556239 -0.0360433 0.0906007 0.2207746 -0.0329269 -0.0677415 -0.2259816 0.1499366 0.1296205 -0.0502669 0.0935116 0.0949592 0.210454 -0.0263559 0.0771534 -0.2160412 0.1531437 -0.1493007 0.0581312 -0.0960354 0.1029271 unknown
polarizability: 143.3560385|-0.266805|107.0075001|4.4254202|0.0012726|54.273285 unknown
InChI: InChI=1S/C5H10N6/c1-3-2-4(10-6)9-5(8-3)11-7/h2,10-11H,6-7H2,1H3
charge 0 multiplicity 1
21 atoms
N  1.278953 0.69569 0.077988
N  -0.072053 -1.353351 0.011116
N  -2.387915 -1.306808 -0.100357
N  2.256184 -1.449269 0.124161
N  -3.633817 -0.683997 -0.174729
N  3.571124 -0.932383 0.182492
C  0.122433 1.438147 0.022778
C  -1.200558 -0.584572 -0.042373
C  -1.153979 0.838768 -0.038761
C  1.111891 -0.667326 0.069486
C  0.28539 2.943735 0.030885
H  -2.075534 1.420049 -0.082919
H  -0.232536 3.394338 0.89769
H  1.354632 3.201169 0.081487
H  -0.148501 3.394872 -0.880639
H  -2.289551 -2.328396 -0.10289
H  2.151012 -2.462654 0.112157
H  -4.219069 -0.755046 0.659832
H  -4.113186 -0.74722 -1.075186
H  3.766156 -0.352606 -0.647202
H  3.696225 -0.364242 1.033387
