program: Gaussian 09
title: TEXT
version: ES64L-G09RevD.01
method: RB3LYP
basis: TZVP
operation: Freq
keyword: #P
keyword: Geom=AllCheck
keyword: Guess=TCheck
keyword: SCRF=Check
keyword: GenChk
keyword: RB3LYP/TZVP
keyword: Freq
converged: YES YES NO YES
title: Mulliken charges:
elementType: P C H C H C H H C H H C H H C H H C H H C H H C H H C H H C H H C H H C H H P C H C H C H H C H H C H H C H H C H H C H H C H H C H H C H H C H H C H H Ni C C C C H C H C H H H C H H C H H C H H H Se
charge: 0.393348 -0.210670 0.164171 -0.245137 0.198850 -0.280824 0.115729 0.186951 -0.232131 0.121902 0.119104 -0.270788 0.148554 0.120666 -0.410963 0.173585 0.171125 -0.222685 0.140797 0.124267 -0.229873 0.115643 0.129351 -0.238472 0.130270 0.103696 -0.243728 0.131941 0.120069 -0.247925 0.103510 0.132036 -0.224379 0.131716 0.101845 -0.226729 0.127427 0.115356 0.393778 -0.220457 0.161303 -0.226984 0.191377 -0.262057 0.101800 0.173971 -0.230608 0.138483 0.114869 -0.256334 0.148048 0.117056 -0.425877 0.175691 0.171436 -0.267155 0.138202 0.147887 -0.234999 0.116254 0.128581 -0.238847 0.128288 0.101447 -0.246314 0.127860 0.124929 -0.234552 0.100861 0.131681 -0.223140 0.130157 0.099684 -0.224972 0.125387 0.118333 -0.263414 0.020351 -0.137801 -0.149666 -0.102905 0.128214 -0.088527 0.131416 -0.163424 0.104157 0.105722 0.110379 -0.224455 0.120856 0.123407 -0.185779 0.106390 0.106232 -0.370497 0.110669 0.112228 0.120230 -0.366456
chargesum: 0.00000
title: Mulliken charges with hydrogens summed into heavy atoms:
elementType: P C C C C C C C C C C C C C P C C C C C C C C C C C C C Ni C C C C C C C C C Se
charge: 0.393348 -0.046499 -0.046287 0.021857 0.008875 -0.001568 -0.066253 0.042379 0.015121 -0.004506 0.008282 -0.012379 0.009182 0.016053 0.393778 -0.059154 -0.035606 0.013714 0.022744 0.008770 -0.078751 0.018934 0.009836 -0.009112 0.006475 -0.002009 0.006701 0.018748 -0.263414 0.020351 -0.009587 -0.018249 0.001252 0.017195 -0.053045 0.019808 0.026843 -0.027369 -0.366456
polarizability: 6.21110524e+02 -2.29940325e+01 6.04481189e+02 -2.41015230e+01 9.72948509e+00 5.70759245e+02
1716.lowfreq: -8.5336 -6.6947 -3.1958 0.0079 0.0091 0.0095 18.7788 20.7223 32.1999
redmass: 5.2773 3.3202 4.1026 3.1051 3.2807 2.5786 3.5636 3.5946 4.0155 3.6742 4.0000 4.3976 3.1810 3.0730 4.5468 3.6059 2.7616 4.1184 4.2233 2.9701 5.2520 4.8127 3.5926 3.9922 3.8596 3.4112 3.3311 3.7375 5.6375 3.5003 3.2047 3.3079 3.0625 4.9715 2.0192 1.1284 2.2819 2.1222 2.4208 2.9175 3.0372 2.2417 5.8269 4.0334 4.6210 1.9558 2.0065 2.3451 2.5523 3.4379 3.9127 3.9901 2.9176 3.1489 2.2295 2.8922 2.9955 2.9264 2.8571 3.1204 2.7982 2.2704 3.1284 3.0711 1.7347 1.7705 1.8264 2.2396 6.4350 3.7308 2.9860 3.4475 6.6700 4.3770 1.2525 2.6109 2.7762 2.5848 1.1022 2.8747 1.4767 1.5014 1.4896 1.7995 1.4802 3.3005 3.3108 3.4551 3.3491 1.2034 1.2551 1.8210 1.8130 1.7115 1.7884 1.8262 2.0637 2.0576 1.8616 2.2037 1.7272 1.8568 1.9730 2.0274 2.0741 1.8452 1.4233 1.3952 1.4835 1.5276 1.2139 1.3313 6.0923 2.4812 2.0949 2.1394 2.1686 2.1561 1.5402 1.6907 4.5250 2.0185 1.9831 1.9863 1.9949 1.9551 1.9408 1.7160 1.7443 2.0588 1.8116 2.8583 2.8237 2.9560 3.0546 1.0733 1.0732 1.8815 1.0875 1.0758 1.1047 1.8276 1.9387 2.0923 1.8665 1.4412 1.1160 1.2816 1.2735 1.1648 1.3263 1.3327 1.2703 1.3654 1.3672 1.4309 1.3396 1.3346 1.3530 4.3258 1.2785 1.2788 1.2778 1.2609 1.2315 1.2424 1.2344 1.2459 1.2284 1.2522 1.2366 1.2364 1.2030 1.1040 1.2038 1.2136 1.1953 1.2017 1.4775 1.3901 1.3284 1.3296 1.3523 1.3501 1.3328 1.3158 1.2873 1.4257 1.2885 1.3771 1.4378 1.4273 1.3902 1.4479 1.4380 1.4002 1.4030 1.3995 1.3861 1.3748 1.2267 1.9738 1.0763 1.0934 1.0959 1.0864 1.0875 1.0894 1.0903 1.0903 1.0896 1.0527 1.0902 1.0880 1.0892 1.0859 1.0899 1.0968 1.0886 1.0392 1.1233 1.0943 1.1047 1.6686 1.0969 1.1003 1.1086 1.0917 1.0912 4.7460 4.9873 1.0807 1.0804 1.0682 1.0690 1.0697 1.0696 1.0688 1.0697 1.0674 1.0658 1.0636 1.0645 1.0656 1.0625 1.0619 1.0374 1.0619 1.0641 1.0568 1.0635 1.0691 1.0733 1.0801 1.0712 1.0784 1.1028 1.0870 1.0915 1.0924 1.0957 1.0922 1.0890 1.0867 1.0877 1.0773 1.0894 1.0930 1.0976 1.0981 1.0635 1.0731 1.0972 1.0594 1.0972 1.0998 1.0972 1.1010 1.0986 1.1030 1.1040 1.1019 1.1034 1.1023 1.0994 1.1086 1.0844 1.0857 1.0902 1.0933 1.0969
irintensity: 0.0533 0.5397 0.7714 0.0038 0.1726 0.0390 0.3735 0.4815 0.2655 0.4147 0.0853 0.1546 0.0525 0.5870 0.1032 1.5823 0.0256 0.2944 0.4117 0.4811 1.1859 2.1895 0.5312 2.6982 0.6831 0.1348 0.3062 1.1624 2.3287 0.1978 0.1255 0.0385 1.0857 0.5391 0.1876 0.0888 0.8484 0.3766 0.7996 3.3490 0.4854 0.4824 2.5515 0.3828 0.2070 0.0319 0.2409 1.3284 1.8211 3.0242 2.2436 10.8240 0.1793 1.7118 1.4907 3.1727 1.5093 2.5594 2.1295 0.5944 8.6371 11.6386 8.1641 2.2349 4.9479 3.2742 4.3172 32.8341 0.1318 18.4393 19.7716 25.4166 3.3407 1.0892 118.8931 22.4960 3.4663 13.5912 5.8073 23.7906 0.5260 4.7319 0.2231 33.9141 1.0783 1.1372 1.0723 2.0702 1.1510 0.1038 0.3191 12.9376 12.4914 1.3716 14.7393 5.2732 4.9726 5.1459 1.9181 1.1224 4.1962 2.7352 0.2394 2.8090 6.4117 18.8797 3.1149 2.8482 7.4309 3.7159 0.1881 0.7266 0.3064 0.6881 3.0623 2.1840 21.4404 9.7678 0.7324 0.8110 26.5829 2.5888 0.2677 0.0322 0.0830 1.4553 1.6915 4.4918 2.3325 5.0927 4.0276 0.2857 0.4501 0.5818 0.9119 0.3371 1.1168 13.8640 2.3758 2.2857 7.1381 2.3742 3.1052 6.7501 12.2019 2.6566 0.0362 2.7760 1.2309 1.4722 13.2881 0.7676 57.5190 26.5181 9.1103 0.0723 0.9336 6.3412 0.8215 3.5581 0.9049 0.5216 0.7644 1.4540 1.3593 5.9740 5.9301 6.1734 3.9105 4.4084 1.9688 0.3898 1.0010 1.6910 4.7456 2.7610 1.1746 3.9191 0.0598 2.5258 2.0501 0.8294 1.7903 0.8484 0.3254 0.3720 1.6676 1.9531 0.3563 1.6539 0.1342 0.2276 2.9078 0.3116 2.1486 4.1206 0.6798 0.3988 0.4464 1.0725 3.7364 3.1792 7.4021 10.9374 8.3836 6.4893 1.2636 1.6297 3.7719 2.4681 4.9446 0.6751 11.5554 3.2930 2.7548 23.8807 4.2576 30.9413 2.3905 9.6033 4.0909 4.2199 3.7944 19.5140 7.4792 0.6395 1.2385 3.0996 0.2288 2.2896 49.4328 5.3108 5.9037 37.5005 37.6085 65.3558 22.2348 69.6240 32.0540 30.7934 30.7160 21.4521 43.2830 7.4721 21.1769 25.2614 53.9428 16.7568 13.9209 26.8091 27.8221 5.0913 22.6084 12.3190 22.7879 33.8322 6.8827 82.9384 68.1559 118.4914 32.7727 115.9821 24.0482 106.5906 23.1460 102.4297 82.5768 51.0820 32.5688 38.9561 28.8051 18.3311 42.6559 28.6882 22.0570 34.2907 72.0768 50.3410 70.2099 49.8943 31.0673 36.3850 0.4858 18.4966 11.7063 16.4571 9.1865 0.0026 1.2716 57.5682 42.5217
temp: 298.150 k
press: 1.00000 atm
elementType: 15 6 1 6 1 6 1 1 6 1 1 6 1 1 6 1 1 6 1 1 6 1 1 6 1 1 6 1 1 6 1 1 6 1 1 6 1 1 15 6 1 6 1 6 1 1 6 1 1 6 1 1 6 1 1 6 1 1 6 1 1 6 1 1 6 1 1 6 1 1 6 1 1 6 1 1 28 6 6 6 6 1 6 1 6 1 1 1 6 1 1 6 1 1 6 1 1 1 34
symmnumber: 1
zpe: 2340450.3 jmol-1
zpe.correction: 0.891430 hartree
zpe.thermalcorrener: 0.934952 hartree
zpe.thermalcorrenthalpy: 0.935896 hartree
zpe.thermalcorrgfe: 0.813390 hartree
zpe.sumelectzpe: -5962.430209 hartree
zpe.sumelectthermal: -5962.386688 hartree
zpe.sumelectthermalent: -5962.385744 hartree
zpe.sumelectthermalfe: -5962.508250 hartree
dipole: -2.5172 -8.5315 1.0229
dipole: 8.9538
quadrupole: -324.1137 -367.0473 -262.8566
quadrupole: -90.2591 -2.6195 -33.3573
quadrupole: -6.1078 -49.0415 55.1493 -90.2591 -2.6195 -33.3573
hfenergy: -5963.3216398 hartree
pointgroup: C01 [X(C35H60Ni1P2Se1)]
dipole: -0.9903502 -3.3565661 0.4024571 debye
polarizability: 621.1105242|-22.9940325|604.4811886|-24.101523|9.7294851|570.759245 unknown
InChI: InChI=1/35C.Ni.2P.Se.60H
charge 0 multiplicity 1
99 atoms
P  7.06255812 3.8219243 5.43027485
C  5.24637278 3.96593893 4.97715544
H  4.82379652 2.97703917 5.19418931
C  7.0757524 3.74240769 7.29934337
H  6.64876656 4.70976035 7.57903657
C  8.50910662 3.70071979 7.851401
H  8.97772978 2.7497668 7.57788705
H  9.11107827 4.4892251 7.39458236
C  5.09552895 4.23133926 3.46858867
H  5.58661233 5.17600364 3.2271917
H  5.60249729 3.45872935 2.88699398
C  6.22036214 2.63506092 7.93010113
H  5.19566448 2.66593941 7.55398587
H  6.62774381 1.65533925 7.65895764
C  7.44097797 2.085962 4.8307628
H  7.00758516 1.34730569 5.50699207
H  6.92467287 1.98035696 3.87595483
C  4.47115281 5.00957693 5.79972516
H  4.5279248 4.78033238 6.86492291
H  4.92204385 5.99279926 5.6642889
C  6.21667588 2.76178495 9.46004897
H  5.71961397 3.6980009 9.73845071
H  5.62709811 1.95100276 9.89753333
C  3.62213167 4.30172435 3.05268657
H  3.55437802 4.53119891 1.98540436
H  3.15753897 3.31797915 3.19272764
C  8.51024616 3.83031261 9.37783489
H  9.53510458 3.77126333 9.75454354
H  8.13135742 4.82128116 9.6524418
C  2.99947025 5.06636918 5.37223935
H  2.51181795 4.11336357 5.61206995
H  2.48438784 5.83765941 5.95145689
C  7.63825334 2.75337404 10.03082999
H  7.61042571 2.89322846 11.11502583
H  8.09021167 1.76988434 9.85358814
C  2.85779768 5.34262698 3.87380094
H  1.80248988 5.35274576 3.58641044
H  3.25685714 6.33897746 3.65426469
P  9.78112324 3.39347073 3.96155947
C  11.56755774 3.07292925 4.44791223
H  11.70168921 1.98777351 4.35821153
C  9.7355971 3.23369089 2.10033988
H  10.41001532 4.03571511 1.78158963
C  8.34257798 3.57450781 1.54676527
H  7.62321605 2.81583598 1.87307993
H  8.0083622 4.53089503 1.95469768
C  11.78012044 3.47203208 5.91967547
H  11.57905656 4.54254945 6.02021891
H  11.06745927 2.95601939 6.56662588
C  10.23618996 1.90158019 1.52666176
H  11.22981415 1.65621941 1.90815201
H  9.56831356 1.0935135 1.84439626
C  8.94217921 1.86640018 4.64945573
H  9.14582347 1.00021497 4.01776775
H  9.41622626 1.67248351 5.61254765
C  12.60720487 3.76246436 3.54847379
H  12.49151458 3.44996633 2.50940637
H  12.45073707 4.84296715 3.57476611
C  10.25984191 1.94614193 -0.00749557
H  10.99626296 2.69044012 -0.33109841
H  10.59306955 0.98164537 -0.40171668
C  13.20854926 3.16897279 6.38476081
H  13.3336055 3.49812324 7.42031785
H  13.37204929 2.08425878 6.37766205
C  8.36048053 3.61937136 0.0156526
H  7.35618554 3.83284058 -0.36125404
H  8.99972144 4.44907748 -0.30536893
C  14.03334855 3.44887058 4.01822377
H  14.22830373 2.37564535 3.89976499
H  14.74976457 3.97015912 3.37713249
C  8.88579688 2.30948801 -0.57978268
H  8.93779053 2.38145232 -1.66976761
H  8.17888398 1.5021168 -0.35258407
C  14.24410563 3.84328061 5.48196524
H  15.25676893 3.58382535 5.80415464
H  14.14813813 4.93040066 5.57681892
Ni 8.60682511 5.21268925 4.66276814
C  7.50558403 6.70673429 5.2232873
C  7.46220699 7.14899602 6.55322396
C  6.71809034 7.41283883 4.30088662
C  6.66003872 8.21867566 6.94951517
H  8.07414453 6.65526601 7.30015597
C  5.91195479 8.48108698 4.68500111
H  6.74792066 7.13300669 3.25378836
C  5.87078566 8.88619676 6.0173943
H  6.65326063 8.53152408 7.9886107
H  5.3166442 9.00175016 3.94204365
H  5.24382973 9.71646511 6.32085853
C  9.83996268 8.5553063 4.2529699
H  8.97813615 8.81750607 3.64153394
H  9.5396431 8.62855756 5.2969699
C  11.01646825 9.47575735 3.95533364
H  11.87919608 9.1756388 4.55812892
H  11.31634658 9.36391275 2.90856462
C  10.67716673 10.94167191 4.23790663
H  9.83203813 11.27649368 3.62980147
H  10.4053926 11.0884378 5.28707379
H  11.52540578 11.5962433 4.01855182
Se 10.30709859 6.64971489 3.88588423
